{"text_format":"1","workbook":"xlsx","n_sheets":14,"sheets":["Aktualisierungen","Erläuterungen","Eingabe","Daten-Elektrofahrzeug","Daten-Benzin-Dieselfahrzeug","Berechnungen","Förderungen","Wetterdaten","PLZ-Zuordnung","Strompreis","Motorbez. Versicherungssteuer","Enamo-Tarif","topprodukte-elektro","topprodukte-benzin-diesel"],"not_rendered":{"charts":9,"images":29,"macros":1,"external_links":0,"defined_names":27,"comments":0,"pivot_tables":0},"unopened":[],"bounds":{"document_bytes":16777216,"sheet_cells":100000,"rows_first":2000,"rows_last":500,"rows_between":2000,"halvings":0,"cell_chars":16384,"cell_head_chars":4096},"cells_cut":0,"cells_raw":0,"read":"whole","date_system":"1900"}

{"sheet":"Aktualisierungen","index":0,"n_rows":0,"n_cols":0,"rows_kept":0,"cut":false,"hidden":true,"merged":[[4,0,4,8],[5,0,5,8]]}

{"sheet":"Erläuterungen","index":1,"n_rows":0,"n_cols":0,"rows_kept":0,"cut":false,"hidden":true,"merged":[[4,0,4,8],[5,0,5,8],[21,1,21,4],[22,1,22,7]]}

{"sheet":"Eingabe","index":2,"n_rows":145,"n_cols":43,"rows_kept":145,"cut":false,"hidden":false,"merged":[[5,21,12,27],[22,6,22,7],[77,12,77,17],[80,12,80,17],[17,6,17,7],[18,6,18,7],[19,6,19,7],[20,6,20,7],[21,6,21,7],[11,16,11,18],[12,6,12,7],[1,1,1,16],[15,15,15,18],[19,15,19,18],[0,2,0,8],[9,5,9,10],[9,11,9,14],[15,12,15,13],[11,12,12,13],[11,6,11,9],[7,6,7,9],[15,6,15,9],[16,6,16,7],[35,35,35,36],[25,15,25,18],[25,5,25,10],[25,11,25,14],[67,11,67,14],[67,5,67,10],[35,31,35,32],[35,33,35,34],[51,5,51,10],[51,11,51,14],[51,15,51,18],[38,15,38,18],[38,5,38,10],[38,11,38,14],[98,3,98,27],[92,3,92,27],[35,2,35,3],[90,6,90,10],[91,6,91,10],[90,3,90,5],[91,3,91,5],[89,3,89,27],[75,5,75,10],[75,11,75,14]]}
[null,null,null,null,null,null,null,null,null,null,null,null,null,null,null,null,null,null,null,null,null,null,null,null,null,null,null,null,null,null,null,null,null,null,null,null,"Jahreseinkommen",25000,{"$f":"M29*0.015","v":404.84999999999997},{"$f":"20.68/100*AM1","v":83.722979999999993},{"$f":"AM1*AQ9/100","v":141.69749999999999},{"$f":"SUM(AN1:AO1)","v":225.42048}]
[null,"E-Mobilitätsrechner\nE_MOB_Rechner_0221_Vers.6.0",null,null,null,null,null,null,null,null,null,null,null,null,null,null,null,null,null,null,null,null,null,null,null,null,null,null,null,null,null,null,null,null,null,null,null,"Jahr der Anschaffung","CO2 Grenzwert",null,"Einkommen","Einkommenssteuer"]
[null,null,null,null,null,null,null,null,null,null,null,null,null,null,null,null,null,null,null,null,null,null,null,null,null,null,null,null,null,null,null,null,null,null,null,null,null,2016,130,null,11000,0]
[null,null,"1. Fahrzeugauswahl",null,null,null,null,null,null,null,null,null,null,null,null,null,null,null,null,null,null,"7. Ausfüllhilfe",null,null,null,null,null,null,null,null,null,null,null,null,null,null,null,2017,127,null,18000,25]
[null,null,null,null,null,null,null,null,null,null,null,null,null,null,null,null,null,null,null,null,null,null,null,null,null,null,null,null,null,null,null,null,null,null,null,null,null,2018,124,null,31000,35]
[null,null,"Allgemeine Angaben",null,null,null,null,null,null,null,null,null,null,null,null,null,null,null,null,null,null,"Alle weißen Felder sind veränderbar und mit überschreibbaren Defaultwerten befüllt.\nTragen Sie in der ersten Kategorie \"Fahrzeugwahl\" die allgemeinen Eingaben ein und wählen Sie ein Fahrzeug, das Sie vergleichen wollen, aus. Scrollen Sie nach unten und kontrollieren Sie die Defaultwerte aus den Kategorien 2-5. Passen Sie diese Ihren individuellen Gegebenheiten an und entnehmen Sie aus den Grafiken die Ergebnisse.\n\nViel Erfolg wünscht Ihnen\nIhr strommobil-team",null,null,null,null,null,null,null,null,null,null,null,null,null,null,null,2019,121,null,60000,42]
[null,null,null,"Jahreskilometerleistung:",null,null,14000,"[km/a]",null,null,null,null,null,"Betrachtungszeitraum1:",null,null,12,"[a]",null,null,null,null,null,null,null,null,null,null,null,null,null,null,null,null,null,null,null,2020,118,null,90000,48]
[null,null,null,{"$f":"IF(G8=\"privat\",\"Nutzung (Privater Investor):\",IF(G8=\"betrieblich\",\"Nutzung (Betrieb ist Investor):\",IF(G8=\"betrieblich + privat (<6000km/a):\",\"Nutzung (Betrieb ist Investor):\",\"Nutzung (Betrieb ist Investor):\")))","v":"Nutzung (Privater Investor):"},null,null,"privat",null,null,null,null,null,null,null,null,null,null,null,null,null,null,null,null,null,null,null,null,null,null,null,"Laufzeit",{"$f":"Q7","v":12},null,null,null,null,null,null,null,null,1000000,50]
[null,null,null,null,null,null,null,null,null,null,null,null,null,null,null,null,null,null,null,null,null,null,null,null,null,null,null,null,null,null,null,"Benzinfahrzeug",null,null,null,null,null,null,null,null,">1000000",55,{"$f":"IF(AL1<AO3,AP3,IF(AL1<AO4,AP4,IF(AL1<AO5,AP5,IF(AL1<AO6,AP6,IF(AL1<AO7,AP7,IF(AL1<AO8,AP8,AP9))))))","v":35}]
[null,null,"Auswahl",null,null,"Elektrofahrzeug",null,null,null,null,null,"Verbrennungs-Kfz",null,null,null,null,null,null,null,null,null,null,null,null,null,null,null,null,null,null,{"$f":"IF(VLOOKUP($G$12,'Daten-Elektrofahrzeug'!C22:M269,'Daten-Elektrofahrzeug'!K5,FALSE)=\"\",\"ja\",IF(VLOOKUP($G$12,'Daten-Elektrofahrzeug'!C22:M269,'Daten-Elektrofahrzeug'!L5,FALSE)=\"\",\"nein\",H13))","v":"ja"}]
[null,null,null,null,null,null,null,null,null,null,null,null,null,null,"*",null,null,null,null,null,null,null,null,null,null,null,null,null,null,null,"Investition",{"$f":"M29/AF8","v":2249.1666666666665},{"$f":"AF11/$AF$16","v":0.57536884148556433}]
[null,null,null,{"$f":"IF(H137=\"\",\"Neuwagen (inkl.Akku):\",\"Neuwagen:\")","v":"Neuwagen (inkl.Akku):"},null,null,"VW ID.3 Pro (58 kWh) Basis",null,null,null,null,null,"VW Golf - Benzin",null,null,null,null,null,null,null,null,null,null,null,null,null,null,null,null,null,"Heimladestation",{"$f":"M31/10","v":0},{"$f":"AF12/$AF$16","v":0}]
[null,null,null,"Batterie mieten oder kaufen:",null,null,"Akku kaufen!",null,null,null,null,null,null,null,null,null,null,null,null,null,null,null,null,null,null,null,null,null,null,null,"Motorbez. Versicherungssteuer",{"$f":"M43","v":328.32},{"$f":"AF13/$AF$16","v":8.3988928360077278E-2}]
[null,null,null,"Batterieleasing Laufzeit:",null,null,36,"[Monate]",null,null,null,null,null,null,null,null,null,null,null,null,null,null,null,null,null,null,null,null,null,null,"Wartung",{"$f":"M45","v":500},{"$f":"AF14/$AF$16","v":0.12790711555810991}]
[null,null,"Leistungsdaten",null,null,null,null,null,null,null,null,null,null,null,null,null,null,null,null,null,null,"8. Vollkosten pro Kilometer",null,null,null,null,null,null,null,null,"Verbrauch",{"$f":"M61","v":831.60000000000014},{"$f":"AF15/$AF$16","v":0.21273511459624841}]
[null,null,null,"Kraftstoff:",null,null,{"$f":"VLOOKUP($G$12,'Daten-Elektrofahrzeug'!C6:M269,'Daten-Elektrofahrzeug'!F5,FALSE)","v":"Elektrizität"},null,null,null,null,null,{"$f":"VLOOKUP($M$12,'Daten-Benzin-Dieselfahrzeug'!C6:M215,'Daten-Benzin-Dieselfahrzeug'!E5,FALSE)","v":"Benzin"},null,null,"Leistungsunterschied",null,null,null,null,null,null,null,null,null,null,null,null,null,null,null,{"$f":"SUM(AF11:AF15)","v":3909.086666666667}]
[null,null,null,"Leistung:",null,null,{"$f":"VLOOKUP($G$12,'Daten-Elektrofahrzeug'!C6:M269,'Daten-Elektrofahrzeug'!E5,FALSE)","v":107},null,"[kW]",null,null,null,{"$f":"VLOOKUP($M$12,'Daten-Benzin-Dieselfahrzeug'!C6:M215,'Daten-Benzin-Dieselfahrzeug'!D5,FALSE)","v":96},"[kW]",null,null,{"$f":"IF(M17-G17<0,(M17-G17)*-1,M17-G17)","v":11},"[kW]"]
[null,null,null,null,null,null,{"$f":"G17*1.3596216","v":145.47951120000002},null,"[PS]",null,null,null,{"$f":"M17*1.3596216","v":130.5236736},"[PS]",null,null,{"$f":"IF(M18-G18<0,(M18-G18)*-1,M18-G18)","v":14.955837600000024},"[PS]",null,null,null,null,null,null,null,null,null,null,null,null,null,"Elektrofahrzeug"]
[null,null,null,"Spezifischer Energiebedarf:",null,null,{"$f":"VLOOKUP($G$12,'Daten-Elektrofahrzeug'!C6:M269,'Daten-Elektrofahrzeug'!G5,FALSE)","v":15.7},null,"[kWh/100km]",null,null,null,{"$f":"VLOOKUP($M$12,'Daten-Benzin-Dieselfahrzeug'!C6:M215,'Daten-Benzin-Dieselfahrzeug'!G5,FALSE)","v":5.4},"[l/100km]"]
[null,null,null,"Ladewirkungsgrad2:",null,null,0.95,null,"[]",null,null,null,{"$f":"M19/100*$G$7","v":756.00000000000011},"[l/a]",null,"Energieeinsparung",null,null,null,null,null,null,null,null,null,null,null,null,null,null,"Investition (inkl. Förderung)",{"$f":"($G$29-$G$32)/$AF$8","v":2535},{"$f":"AF20/$AF$25","v":0.76548662158562608}]
[null,null,null,"Jahresbedarf:",null,null,{"$f":"(G19/100*$G$7)/G20","v":2313.6842105263158},null,"[kWh/a]",null,null,null,{"$f":"IF(M16=\"Benzin\",M20*'Daten-Benzin-Dieselfahrzeug'!$O$3,M20*'Daten-Benzin-Dieselfahrzeug'!$O$4)","v":6456.2400000000007},"[kWh/a]",null,null,{"$f":"M21-G21","v":4142.5557894736849},"[kWh/a]",null,null,null,null,null,null,null,null,null,null,null,null,"Heimladestation",{"$f":"$G$31/$AF$8","v":100},{"$f":"AF21/$AF$25","v":3.0196710910675585E-2}]
[null,null,null,"direkte CO2-Emissionen3:",null,null,{"$f":"VLOOKUP($G$12,'Daten-Elektrofahrzeug'!C6:M269,'Daten-Elektrofahrzeug'!I5,FALSE)","v":0},null,"[g/km]",null,null,null,{"$f":"VLOOKUP($M$12,'Daten-Benzin-Dieselfahrzeug'!C6:M215,'Daten-Benzin-Dieselfahrzeug'!H5,FALSE)","v":122},"[g/km]",null,null,null,null,null,null,null,null,null,null,null,null,null,null,null,null,"Motorbez. Versicherungssteuer",{"$f":"$G$43","v":0},{"$f":"AF22/$AF$25","v":0}]
[null,null,null,"Jährlichen direkten CO2-Emissionen:",null,null,{"$f":"G22*G7/1000","v":0},null,"[kg/a]",null,null,null,{"$f":"M22*G7/1000","v":1708},"[kg/a]",null,null,null,null,null,null,null,null,null,null,null,null,null,null,null,null,"Wartung",{"$f":"$G$45","v":200},{"$f":"AF23/$AF$25","v":6.039342182135117E-2}]
[null,null,null,null,null,null,null,null,null,null,null,null,null,null,null,null,null,null,null,null,null,null,null,null,null,null,null,null,null,null,"Verbrauch",{"$f":"$G$61","v":476.61894736842106},{"$f":"AF24/$AF$25","v":0.14392324568234713}]
[null,null,null,null,null,null,null,null,null,null,null,null,null,null,null,null,null,null,null,null,null,null,null,null,null,null,null,null,null,null,null,{"$f":"SUM(AF20:AF24)","v":3311.6189473684212}]
[null,null,"2. Investitionskosten",null,null,"Elektrofahrzeug",null,null,null,null,null,"Verbrennungs-Kfz",null,null,null,"Differenz",null,null,null,null,null,"9. Vollkosten (Betrachtungszeitraum 12 Jahre)"]
[]
[null,null,null,null,null,null,"BRUTTO",null,"NETTO",null,null,null,null,null,null,null,null,null,null,null,null,"Monatliche Vollkosten"]
[null,null,null,{"$f":"IF(G8=\"Privat\",\"Privatfahrzeug:\",\"Vorsteuerabzug (Betriebsfahrzeug):\")","v":"Privatfahrzeug:"},null,null,{"$f":"VLOOKUP($G$12,'Daten-Elektrofahrzeug'!C6:M269,IF(OR(G13=H136,H137=\"\"),'Daten-Elektrofahrzeug'!L5,'Daten-Elektrofahrzeug'!J5),FALSE)","v":35420},"[€]",{"$f":"IF((G29-G32)<80000,IF((G29-G32)<=40000,(G29-G32)/1.2,(G29-G32)-(40000-(40000/1.2))),(G29-G32))","v":25350},"[€]",null,null,{"$f":"VLOOKUP($M$12,'Daten-Benzin-Dieselfahrzeug'!C6:M215,'Daten-Benzin-Dieselfahrzeug'!I5,FALSE)","v":26990},"[€]",null,null,{"$f":"IF(G8<>C117,M29-I29,M29-G29)","v":-8430},"[€]"]
[]
[null,null,null,"Heimladestation (Investition Wallbox):",null,null,1200,"[€]",{"$f":"G31*$C$125","v":1000},"[€]",null,null,null,null,null,null,{"$f":"IF(G8<>C117,I31*-1,G31*-1)","v":-1200},"[€]"]
[null,null,null,"Förderung (Auto + Heimladestation):",null,null,5000,"[€]",null,null,null,{"$f":"IF($G$8<>$C$117,\"                Förderung ist im Nettoanschaffungswert integriert!\",\"\")","v":""},null,null,null,null,{"$f":"IF($G$8=C117,G32-M32,I32-M32)","v":5000},"[€]"]
[null,null,null,null,null,null,null,null,null,null,null,null,null,null,null,null,{"$f":"SUM(Q29:Q32)","v":-4630},"[€]"]
[null,null,null,"Investitionen in den Akku erfolgen im Jahr:",null,null,9,"[a]"]
[null,null,null,"Höhe der Investition (dzt. 200€/kWh)4:",null,null,2000,"[€]",{"$f":"G35*$C$125","v":1666.6666666666667},"[€]",null,null,null,null,null,null,{"$f":"IF($G$8<>C117,I35*-1,G35*-1)","v":-2000},"[€]"]
[null,null,{"$f":"VLOOKUP($G$12,'Daten-Elektrofahrzeug'!C22:N269,'Daten-Elektrofahrzeug'!N5,FALSE)","v":"Info zur Akkugarantie: 8 Jahre bis 160.000 km"},null,null,null,null,null,null,null,null,null,null,null,null,null,null,null,null,null,null,null,null,null,null,null,null,null,null,null,null,"jährliche Vollkosten",null,"monatliche Vollkosten",null,"tägliche Vollkosten"]
[null,null,null,null,null,null,null,null,null,null,null,null,null,null,null,null,null,null,null,null,null,null,null,null,null,null,null,null,null,null,null,{"$f":"F10","v":"Elektrofahrzeug"},{"$f":"L10","v":"Verbrennungs-Kfz"},{"$f":"AF37","v":"Elektrofahrzeug"},{"$f":"AG37","v":"Verbrennungs-Kfz"},{"$f":"AH37","v":"Elektrofahrzeug"},{"$f":"AI37","v":"Verbrennungs-Kfz"}]
[null,null,null,null,null,null,null,null,null,null,null,null,null,null,null,null,null,null,null,null,null,null,null,null,null,null,null,null,null,null,"Investition",{"$f":"IF(G8<>C117,((I29+I31+I35)/AF8),(G29+G31+G35-G32)/AF8)","v":2801.6666666666665},{"$f":"M29/AF8","v":2249.1666666666665},{"$f":"AF38/12","v":233.4722222222222},{"$f":"AG38/12","v":187.43055555555554},{"$f":"AH38/30.4","v":7.6800073099415203},{"$f":"AI38/30.4","v":6.1654788011695905}]
[null,null,"3. Betriebskosten",null,null,"Elektrofahrzeug",null,null,null,null,null,"Verbrennungs-Kfz",null,null,null,"Differenz",null,null,null,null,null,"Jährliche Vollkosten",null,null,null,null,null,null,null,null,"Betriebskosten",{"$f":"IF(G8<>C117,SUM(I43:I48),SUM(G43:G48))","v":705.4},{"$f":"SUM(M43:M48)","v":1333.72},{"$f":"AF39/12","v":58.783333333333331},{"$f":"AG39/12","v":111.14333333333333},{"$f":"AH39/30.4","v":1.9336622807017545},{"$f":"AI39/30.4","v":3.656030701754386}]
[null,null,null,null,null,null,null,null,null,null,null,null,null,null,null,null,null,null,null,null,null,null,null,null,null,null,null,null,null,null,"Verbrauchskosten",{"$f":"IF(G8<>C117,SUM(I61+I64),SUM(G61+G64))","v":476.61894736842106},{"$f":"M61","v":831.60000000000014},39.718245614035091,69.300000000000011,1.306521237303786,2.2796052631578951]
[null,null,null,null,null,null,"BRUTTO",null,"NETTO",null,null,null,null,null,null,null,null,null,null,null,null,null,null,null,null,null,null,null,null,null,"Summe:",{"$f":"SUM(AF38:AF40)","v":3983.6856140350878},4414.4866666666667,331.97380116959062,367.87388888888887,10.92019082794706,12.101114766081873]
[null,null,"jährliche","Zahlungsweise der motorbez.",null,null,null,null,null,null,null,null,null,null,null,null,null,null,null,null,null,null,null,null,null,null,null,null,null,null,"Vollkosten [€/km]",{"$f":"AF41/$G$7","v":0.28454897243107768},{"$f":"AG41/$G$7","v":0.31532047619047621}]
[null,null,null,"Versicherungssteuer:",null,null,0,"[€/a]",0,"[€/a]",null,null,{"$f":"'Motorbez. Versicherungssteuer'!E2","v":328.32},"[€/a]",null,null,{"$f":"M43-G43","v":328.32},"[€]",null,null,null,null,null,null,null,null,null,null,null,null,"Verbauchskosten [€/km]",{"$f":"AF40/$G$7*100","v":3.4044210526315788},{"$f":"AG40/$G$7*100","v":5.9400000000000013}]
[null,null,null,"Versicherungsprämie (exkl. motorb. Vers.):",null,null,300,"[€/a]",{"$f":"G44","v":300},"[€/a]",null,null,300,"[€/a]",null,null,{"$f":"IF($G$8<>C117,M44-I44,M44-G44)","v":0},"[€]"]
[null,null,0.6,{"$f":"\"Wartungseinsparung(\"&C45*100&\"%):\"","v":"Wartungseinsparung(60%):"},null,null,{"$f":"M45*(1-C45)","v":200},"[€/a]",{"$f":"G45*$C$125","v":166.66666666666669},"[€/a]",null,null,500,"[€/a]",null,null,{"$f":"IF($G$8<>C117,M45-I45,M45-G45)","v":300},"[€]"]
[null,null,null,"Mitgliedsbeitrag Autofahrerclub:",null,null,121,"[€/a]",100.83333333333334,"[€/a]",null,null,121,"[€/a]",null,null,{"$f":"IF($G$8<>C117,M46-I46,M46-G46)","v":0},"[€]"]
[null,null,null,"Vignette/Umweltplakette...:",null,null,84.4,"[€/a]",70.333333333333343,"[€/a]",null,null,84.4,"[€/a]",null,null,{"$f":"IF($G$8<>C117,M47-I47,M47-G47)","v":0},"[€]"]
[null,null,0.3,"Lohnnebenkosten Sachbezug:5",null,null,0,"[€/a]",0,"[€/a]",null,null,{"$f":"IF(OR(G8=C117,G8=C118),0,IF(G8=C119,(VLOOKUP($M$12,'Daten-Benzin-Dieselfahrzeug'!C6:O215,'Daten-Benzin-Dieselfahrzeug'!K5,FALSE))*6,(VLOOKUP($M$12,'Daten-Benzin-Dieselfahrzeug'!C6:O215,'Daten-Benzin-Dieselfahrzeug'!K5,FALSE))*12))","v":0},"[€/a]",null,null,{"$f":"IF($G$8<>C117,M48-I48,M48-G48)","v":0},"[€]"]
[null,null,null,{"$f":"IF(OR(C117=G8,C118=G8),\"\",\"(Arbeitnehmervorteile bleiben unberücksichtigt!)\")","v":""},null,null,null,null,null,null,null,null,null,null,null,null,{"$f":"SUM(Q43:Q48)","v":628.31999999999994},"[€]"]
[]
[]
[null,null,"4. Verbrauchskosten",null,null,"Elektrofahrzeug",null,null,null,null,null,"Verbrennungs-Kfz",null,null,null,"Differenz",null,null,null,null,null,"10. Übersicht über die jährlichen Ersparnisse (Barwerte)"]
[]
[null,null,"Energieträger",null,null,null,"BRUTTO",null,"NETTO"]
[null,null,null,"Ladung an der Heimladestation:",null,null,0.9]
[null,null,null,"Tarif Heimladestation:",null,null,19,"[c/kWh]",{"$f":"G56*$C$125","v":15.833333333333334},"[c/kWh]"]
[null,null,null,"Tarif Tankstellen:",null,null,35,"[c/kWh]",{"$f":"G57*$C$125","v":29.166666666666668},"[c/kWh]",null,null,null,null,null,null,null,null,null,null,null,null,null,null,null,null,null,null,null,null,null,null,"<=24",">24-91",">92-111",">111"]
[null,null,null,"Mischtarif Heimladung/öffentliche Ladung:",null,null,{"$f":"G56*$G$55+G57*(1-$G$55)","v":20.6},"[c/kWh]",{"$f":"I56*$G$55+I57*(1-$G$55)","v":17.166666666666664},"[c/kWh]",null,null,null,null,null,null,null,null,null,null,null,null,null,null,null,null,null,null,null,null,null,"jährliche",0,0.62,0.66,0.75]
[null,null,null,null,null,null,null,null,null,null,null,null,null,null,null,null,null,null,null,null,null,null,null,null,null,null,null,null,null,null,null,"½-jährliche",0,0.65720000000000001,0.6996,0.79500000000000004]
[null,null,null,"Kraftstoffpreise:",null,null,null,null,null,null,null,null,1.1000000000000001,"[€/l]",null,null,null,null,null,null,null,null,null,null,null,null,null,null,null,null,null,"¼-jährliche",0,0.66959999999999997,0.71279999999999999,0.81]
[null,null,null,"Kraftstoffkosten:",null,null,{"$f":"$G$21*G58/100","v":476.61894736842106},"[€/a]",{"$f":"$G$21*I58/100","v":397.18245614035084},"[€/a]",null,null,{"$f":"M20*M60","v":831.60000000000014},"[€/a]",null,null,{"$f":"IF($G$8<>C117,M61-I61,M61-G61)","v":354.98105263157908},"[€]",null,null,null,null,null,null,null,null,null,null,null,null,null,"monatliche",0,0.68200000000000005,0.72599999999999998,0.82499999999999996]
[null,null,"Sonstiges"]
[null,null,null,"Batteriemiete:",null,null,{"$f":"G64/12","v":0},"[€/m]",{"$f":"G63*$C$125","v":0},"[€/m]"]
[null,null,null,null,null,null,{"$f":"IF(G8=\"betrieblich\",((VLOOKUP($G$12,'Daten-Elektrofahrzeug'!C6:M269,IF(OR(G13=H136,H137=\"\"),'Daten-Elektrofahrzeug'!M5,'Daten-Elektrofahrzeug'!K5),FALSE))*12),((VLOOKUP($G$12,'Daten-Elektrofahrzeug'!C6:M269,IF(OR(G13=H136,H137=\"\"),'Daten-Elektrofahrzeug'!M5,'Daten-Elektrofahrzeug'!K5),FALSE))*12))","v":0},"[€/a]",{"$f":"G64*$C$125","v":0},"[€/a]",null,null,null,null,null,null,{"$f":"IF(G8=C118,I64*-1,G64*-1)","v":0},"[€]"]
[null,null,null,null,null,null,null,null,null,null,null,null,null,null,null,null,{"$f":"Q61+Q64","v":354.98105263157908},"[€]"]
[]
[]
[null,"5. Wirtschaftliche Entwicklung",null,null,null,null,null,null,null,null,null,null,null,null,null,null,null,null,null,null,null,"11. Übersicht Rentabilität (Kapitalwerteverlauf)"]
[]
[null,null,null,"Inflationsrate/Jahr:",null,null,1.5,"[%]"]
[null,null,null,"Strompreissteigerung/Jahr:",null,null,1.5,"[%]"]
[null,null,null,"Spritpreissteigerung/Jahr:",null,null,2,"[%]"]
[null,null,null,"Kalkulationszinssatz:",null,null,1.5,"[%]"]
[]
[]
[null,null,"6. Zusammenfassung"]
[]
[null,null,"Energie"]
[null,null,null,"Energieeinsparungen pro Jahr:",null,null,{"$f":"Q21","v":4142.5557894736849},"[kWh/a]"]
[null,null,null,"Eingesparte Energie nach 12 Jahren:",null,null,{"$f":"G79*$Q$7","v":49710.669473684218},"[kWh]"]
[null,null,"CO2"]
[null,null,null,"CO2-Einsparungen pro Jahr:",null,null,{"$f":"M23","v":1708},"[kg CO2/a]"]
[null,null,null,"CO2-Einsparungen nach 12 Jahren:",null,null,{"$f":"(M23*$Q$7)","v":20496},"[kg CO2]"]
[null,null,"Rentabilität"]
[null,null,null,"Mehreinnahmen nach 12 Jahren:",null,null,{"$f":"Berechnungen!$I$20","v":4245.6341645734374},"[€]"]
[null,null,null,"Amortisationsdauer:",null,null,{"$f":"Berechnungen!H17","v":5},"[Jahre]"]
[]
[]
[null,null,"Rechtliche Information:"]
[null,null,null,"Wir möchten darauf hinweisen, dass sich dieses Programm in stetiger Entwicklung befindet und wir die Nutzer bitten, im Falle eines auftretenden Fehlers folgende Person zu kontaktieren, um diese zu korrigieren:"]
[null,null,null,"Kontakt:",null,null,"DI (FH) Franz Jetzinger"]
[null,null,null,null,null,null,"f.jetzinger@linzag.at"]
[null,null,null,"Die LINZ AG sowie alle Mitwirkenden an diesem Programm haben deren Inhalte sorgfältig recherchiert und erstellt. Fehler können dennoch nicht gänzlich ausgeschlossen werden.\nDie Genannten übernehmen daher keine Haftung für die Richtigkeit, Vollständigkeit und Aktualität der Inhalte, insbesondere übernehmen sie keinerlei Haftung für eventuelle unmittelbare oder mittelbare Schäden, die durch direkte oder indirekte Nutzung des angebotenen Programms entstehen."]
[null,null,"Annahmen:"]
[null,null,1,"Das Fahrzeug wird nach 12 Jahren außer Betrieb gesetzt wird (Restwert = 0)."]
[null,null,2,"Der Ladewirkungsgrad Li-Ion mit 0,95 angenommen."]
[null,null,3,"Das Fahrzeug wird zu 100% mit Ökostrom betrieben (direkte CO2-Emissionen eines Elektroautos liegen bei Versorgung mittels Ökostrom bei 0g CO2/km)."]
[null,null,4,"Dieses Feld bietet die Möglichkeit eine Akku-Reinvestition einzugeben - die Kosten liegen dzt. bei 200€/kWh."]
[null,null,5,"Für Kraftfahrzeuge mit einem CO2-Emmissionswert von 0g/km gilt seit dem Kalenderjahr 2016 ein Sachbezugswert von Null."]
[null,null,"*","Die angeführten Verbrennungskraftfahrzeuge sind nicht vorsteuerabzugsfähig!"]
[null,null,"Quellen:"]
[null,null,null,"www.topprodukte.at"]
[null,null,null,"Recknagel, Sprenger, Schramek; Taschenbuch für Heizung + Klimatechnik; 2001; Seite 209"]
[]
[null,null,"Die derzeit aktuelle Version:"]
[null,null,null,"E_MOB_Rechner_0221_Vers.6.0"]
[]
[]
[]
[]
[]
[]
[]
[]
[]
[]
[null,null,"privat"]
[null,null,"betrieblich"]
[null,null,"betrieblich + privat (<6000km/a)"]
[null,null,"betrieblich + privat (>6000km/a)"]
[]
[]
[]
[null,null,"Prozentsatz mit dem die Vorsteuer bei den Verbrauchs- und Betriebskosten abgezogen werden darf"]
[null,null,{"$f":"I29/(G29-G32)","v":0.83333333333333337}]
[]
[]
[]
[]
[]
[]
[]
[]
[]
[]
[null,null,{"$f":"VLOOKUP($G$12,'Daten-Elektrofahrzeug'!C6:M269,'Daten-Elektrofahrzeug'!K5,FALSE)","v":0},{"$f":"IF(C136=0,\"Hersteller bietet keine Akku-Mietvariante!\",\"Akkumietvariante möglich\")","v":"Hersteller bietet keine Akku-Mietvariante!"},null,null,null,{"$f":"D137","v":"Akku kaufen!"}]
[null,null,null,"Akku kaufen!",null,null,null,{"$f":"IF(D136=\"Hersteller bietet keine Akku-Mietvariante!\",\"\",D138)","v":""}]
[null,null,null,"Akku mieten!"]
[]
[]
[]
[]
[null,null,"ja",null,null,null,12]
[null,null,"nein",null,null,null,24]
[null,null,null,null,null,null,36]

{"sheet":"Daten-Elektrofahrzeug","index":3,"n_rows":267,"n_cols":50,"rows_kept":267,"cut":false,"hidden":false,"merged":[[0,0,0,2],[2,6,2,7],[2,9,2,10],[2,11,2,12],[1,6,1,7],[1,0,1,2]]}
["Allgemeine Daten Elektrofahrzeuge",null,null,null,null,null,null,null,null,null,null,null,null,null,null,null,null,null,null,null,null,null,null,null,null,null,null,null,null,null,null,null,"Batteriemiete und Berechnung \"Nissan Leaf\"",null,null,null,null,null,null,null,null,"Batteriemiete und Berechnung \"Renault Zoe R90 - Standard\""]
["http://www.topprodukte.at",null,null,null,null,null,"Stromverbrauch",null,"CO2-Emissionen",null,null,null,null,null,null,null,null,null,null,null,null,null,null,null,null,null,null,null,null,null,{"$f":"VLOOKUP(AF2,AG2:AL5,IF(AM7+1<=1,6,AM7+1),TRUE)","v":86},{"$f":"IF(Eingabe!G14<='Daten-Elektrofahrzeug'!AG3,'Daten-Elektrofahrzeug'!AG3,IF(Eingabe!G14<='Daten-Elektrofahrzeug'!AG4,'Daten-Elektrofahrzeug'!AG4,'Daten-Elektrofahrzeug'!AG5))","v":36},"Vertragslaufzeit",12500,15000,17500,20000,25000,null,{"$f":"VLOOKUP(AO2,AP2:AW5,IF(AX7+1<=1,8,AX7+1),TRUE)","v":89},{"$f":"IF(Eingabe!$G$14<='Daten-Elektrofahrzeug'!AP3,'Daten-Elektrofahrzeug'!AP3,IF(Eingabe!$G$14<='Daten-Elektrofahrzeug'!AP4,'Daten-Elektrofahrzeug'!AP4,'Daten-Elektrofahrzeug'!AP5))","v":36},"Vertragslaufzeit",7500,10000,12500,15000,17500,20000,20200]
["Marke","Modell",null,"Typ","Leistung","Kraftstoff","kombiniert",null,"kombiniert","Preis bei Batteriemiete",null,"Preis bei Batteriekauf",null,"Anmerkung Garantie",null,null,null,null,null,null,null,null,null,null,null,null,null,null,null,null,null,null,12,99,106,114,122,142,null,null,null,12,59,69,79,89,99,109,{"$f":"IF(Eingabe!$G$8=\"privat\",119,109)","v":119}]
[null,null,null,null,"[kW]",4,"kWh/100km","l/100km","[g/km]","[€]","[€/Monat]","[€]","[€/Monat]",null,null,null,null,null,null,null,null,null,null,null,null,null,null,null,null,null,null,null,24,89,96,104,112,132,null,null,null,24,59,69,79,89,99,109,{"$f":"IF(Eingabe!$G$8=\"privat\",119,109)","v":119}]
[null,null,1,2,3,4,5,6,7,8,9,10,11,12,null,null,null,null,null,null,null,null,null,null,null,null,null,null,null,null,null,null,36,79,86,94,102,122,null,null,null,36,59,69,79,89,99,109,{"$f":"IF(Eingabe!$G$8=\"privat\",119,109)","v":119}]
["Audi","e-tron (50 quattro)",{"$f":"CONCATENATE(A6,\" \",B6)","v":"Audi e-tron (50 quattro)"},"EV",230,"Elektrizität",23.6,null,0,null,null,69100,null,"Info zur Akkugarantie: 8 Jahre bis 160.000 km",null,null,null,null,null,null,null,null,null,null,null,null,null,null,null,null,null,null,null,{"$f":"IF(AND(Eingabe!$G$7<=AH2),AH2)","v":false},{"$f":"IF(AND(Eingabe!$G$7<=AI2,Eingabe!$G$7>AH2),AI2)","v":15000},{"$f":"IF(AND(Eingabe!$G$7<=AJ2,Eingabe!$G$7>AI2),AJ2)","v":false},{"$f":"IF(AND(Eingabe!$G$7<=AK2,Eingabe!$G$7>AJ2),AK2)","v":false},{"$f":"IF(AND(Eingabe!$G$7<=AL2,Eingabe!$G$7>AK2),AL2)","v":false},null,null,null,null,{"$f":"IF(AND(Eingabe!$G$7<=AQ2),AQ2)","v":false},{"$f":"IF(AND(Eingabe!$G$7<=AR2,Eingabe!$G$7>AQ2),AR2)","v":false},{"$f":"IF(AND(Eingabe!$G$7<=AS2,Eingabe!$G$7>AR2),AS2)","v":false},{"$f":"IF(AND(Eingabe!$G$7<=AT2,Eingabe!$G$7>AS2),AT2)","v":15000},{"$f":"IF(AND(Eingabe!$G$7<=AU2,Eingabe!$G$7>AT2),AU2)","v":false},{"$f":"IF(AND(Eingabe!$G$7<=AV2,Eingabe!$G$7>AU2),AV2)","v":false},{"$f":"IF(AND(Eingabe!$G$7<=AW2,Eingabe!$G$7>AV2),AW2)","v":false}]
["Audi","e-tron (55 quattro)",{"$f":"CONCATENATE(A7,\" \",B7)","v":"Audi e-tron (55 quattro)"},"EV",300,"Elektrizität",24.2,null,0,null,null,81500,null,"Info zur Akkugarantie: 8 Jahre bis 160.000 km",null,null,null,null,null,null,null,null,null,null,null,null,null,null,null,null,null,null,null,{"$f":"IF(AH6=AH2,1,0)","v":0},{"$f":"IF(AI6=AI2,2,0)","v":2},{"$f":"IF(AJ6=AJ2,3,0)","v":0},{"$f":"IF(AK6=AK2,4,0)","v":0},{"$f":"IF(AL6=AL2,5,0)","v":0},{"$f":"SUM(AH7:AL7)","v":2},null,null,null,{"$f":"IF(AQ6=AQ2,1,0)","v":0},{"$f":"IF(AR6=AR2,2,0)","v":0},{"$f":"IF(AS6=AS2,3,0)","v":0},{"$f":"IF(AT6=AT2,4,0)","v":4},{"$f":"IF(AU6=AU2,5,0)","v":0},{"$f":"IF(AV6=AV2,6,0)","v":0},{"$f":"IF(AW6=AW2,7,0)","v":0},{"$f":"SUM(AQ7:AW7)","v":4}]
["Audi","e-tron advanced (50 quattro)",{"$f":"CONCATENATE(A8,\" \",B8)","v":"Audi e-tron advanced (50 quattro)"},"EV",230,"Elektrizität",23.6,null,0,null,null,70550,null,"Info zur Akkugarantie: 8 Jahre bis 160.000 km"]
["Audi","e-tron advanced (55 quattro)",{"$f":"CONCATENATE(A9,\" \",B9)","v":"Audi e-tron advanced (55 quattro)"},"EV",300,"Elektrizität",24.2,null,0,null,null,82950,null,"Info zur Akkugarantie: 8 Jahre bis 160.000 km"]
["Audi","e-tron business (50 quattro)","Audi e-tron business (50 quattro)","EV",230,"Elektrizität",24.2,null,0,null,null,59990,null,"Info zur Akkugarantie: 8 Jahre bis 160.000 km"]
["Audi","e-tron business (55 quattro)","Audi e-tron business (55 quattro)","EV",300,"Elektrizität",24.2,null,0,null,null,74300,null,"Info zur Akkugarantie: 8 Jahre bis 160.000 km"]
["Audi","e-tron S line (50 quattro)","Audi e-tron S line (50 quattro)","EV",230,"Elektrizität",23.6,null,0,null,null,72050,null,"Info zur Akkugarantie: 8 Jahre bis 160.000 km"]
["Audi","e-tron S line (55 quattro)","Audi e-tron S line (55 quattro)","EV",300,"Elektrizität",24.2,null,0,null,null,84450,null,"Info zur Akkugarantie: 8 Jahre bis 160.000 km"]
["Audi","e-tron S ","Audi e-tron S ","EV",370,"Elektrizität",27.3,null,0,null,null,93800,null,"Info zur Akkugarantie: 8 Jahre bis 160.000 km"]
["Audi","e-tron Sportback (50 quattro)","Audi e-tron Sportback (50 quattro)","EV",230,"Elektrizität",23.3,null,0,null,null,71350,null,"Info zur Akkugarantie: 8 Jahre bis 160.000 km"]
["Audi","e-tron Sportback (55 quattro)",{"$f":"CONCATENATE(A16,\" \",B16)","v":"Audi e-tron Sportback (55 quattro)"},"EV",300,"Elektrizität",23.8,null,0,null,null,83750,null,"Info zur Akkugarantie: 8 Jahre bis 160.000 km"]
["Audi","e-tron Sportback advanced \n(50 quattro)",{"$f":"CONCATENATE(A17,\" \",B17)","v":"Audi e-tron Sportback advanced \n(50 quattro)"},"EV",230,"Elektrizität",23.3,null,0,null,null,72800,null,"Info zur Akkugarantie: 8 Jahre bis 160.000 km"]
["Audi","e-tron Sportback advanced \n(55 quattro)",{"$f":"CONCATENATE(A18,\" \",B18)","v":"Audi e-tron Sportback advanced \n(55 quattro)"},"EV",300,"Elektrizität",23.8,null,0,null,null,85200,null,"Info zur Akkugarantie: 8 Jahre bis 160.000 km"]
["Audi","e-tron Sportback S line \n(50 quattro)",{"$f":"CONCATENATE(A19,\" \",B19)","v":"Audi e-tron Sportback S line \n(50 quattro)"},"EV",230,"Elektrizität",23.3,null,0,null,null,74300,null,"Info zur Akkugarantie: 8 Jahre bis 160.000 km"]
["Audi","e-tron Sportback S line\n(55 quattro)","Audi e-tron Sportback S line\n(55 quattro)","EV",300,"Elektrizität",23.8,null,0,null,null,86700,null,"Info zur Akkugarantie: 8 Jahre bis 160.000 km"]
["Audi","e-tron S Sportback ","Audi e-tron S Sportback ","EV",370,"Elektrizität",26.9,null,0,null,null,96050,null,"Info zur Akkugarantie: 8 Jahre bis 160.000 km"]
["BMW"," i3 120 Ah",{"$f":"CONCATENATE(A22,\" \",B22)","v":"BMW  i3 120 Ah"},"EV",125,"Elektrizität",13.1,null,0,0,0,39000,null,"Info zur Akkugarantie: 8 Jahre bis 160.000 km","2017 ok"]
["BMW"," i3 S 120 Ah",{"$f":"CONCATENATE(A23,\" \",B23)","v":"BMW  i3 S 120 Ah"},"EV",135,"Elektrizität",14.3,null,0,0,0,42600,null,"Info zur Akkugarantie: 8 Jahre bis 160.000 km"]
["BMW","iX3 (Modell INSPIRING)",{"$f":"CONCATENATE(A24,\" \",B24)","v":"BMW iX3 (Modell INSPIRING)"},"EV",210,"Elektrizität",17.7,null,0,null,null,66300,null,"Info zur Akkugarantie: 8 Jahre bis 160.000 km"]
["BMW","iX3 (Modell IMPRESSIVE)",{"$f":"CONCATENATE(A25,\" \",B25)","v":"BMW iX3 (Modell IMPRESSIVE)"},"EV",210,"Elektrizität",17.7,null,0,null,null,71800,null,"Info zur Akkugarantie: 8 Jahre bis 160.000 km"]
["CITROEN","C Zero",{"$f":"CONCATENATE(A26,\" \",B26)","v":"CITROEN C Zero"},"EV",49,"Elektrizität",17,null,0,0,0,21990,null,"Info zur Akkugarantie: 8 Jahre bis 100.000 km","2017 ok"]
["CITROEN","e-C4 (Feel)",{"$f":"CONCATENATE(A27,\" \",B27)","v":"CITROEN e-C4 (Feel)"},"EV",100,"Elektrizität",16.600000000000001,null,0,null,null,35950,null,"Info zur Akkugarantie: 8 Jahre bis 160.000 km"]
["CITROEN","e-C4 (Shine)",{"$f":"CONCATENATE(A28,\" \",B28)","v":"CITROEN e-C4 (Shine)"},"EV",100,"Elektrizität",16.600000000000001,null,0,null,null,37150,null,"Info zur Akkugarantie: 8 Jahre bis 160.000 km"]
["CITROEN","e-C4 (Shine edition)",{"$f":"CONCATENATE(A29,\" \",B29)","v":"CITROEN e-C4 (Shine edition)"},"EV",100,"Elektrizität",16.600000000000001,null,0,null,null,38650,null,"Info zur Akkugarantie: 8 Jahre bis 160.000 km"]
["CITROEN","e-SpaceTourer (Feel) XS \n(Batterie 50kWh)","CITROEN e-SpaceTourer (Feel) XS \n(Batterie 50kWh)","EV",100,"Elektrizität",23.9,null,0,null,null,57500,null,"Info zur Akkugarantie: 8 Jahre bis 160.000 km"]
["CITROEN","e-SpaceTourer (Feel) M \n(Batterie 50kWh)",{"$f":"CONCATENATE(A31,\" \",B31)","v":"CITROEN e-SpaceTourer (Feel) M \n(Batterie 50kWh)"},"EV",100,"Elektrizität",23.9,null,0,null,null,58450,null,"Info zur Akkugarantie: 8 Jahre bis 160.000 km"]
["CITROEN","e-SpaceTourer (Feel) XL \n(Batterie 75kWh)","CITROEN e-SpaceTourer (Feel) XL \n(Batterie 75kWh)","EV",100,"Elektrizität",25.9,null,0,null,null,64950,null,"Info zur Akkugarantie: 8 Jahre bis 160.000 km"]
["CITROEN","e-SpaceTourer (Shine) M \n(Batterie 50kWh)","CITROEN e-SpaceTourer (Shine) M \n(Batterie 50kWh)","EV",100,"Elektrizität",23.9,null,0,null,null,66200,null,"Info zur Akkugarantie: 8 Jahre bis 160.000 km"]
["CITROEN","e-SpaceTourer (Shine) M \n(Batterie 75kWh)",{"$f":"CONCATENATE(A34,\" \",B34)","v":"CITROEN e-SpaceTourer (Shine) M \n(Batterie 75kWh)"},"EV",100,"Elektrizität",25.9,null,0,null,null,72200,null,"Info zur Akkugarantie: 8 Jahre bis 160.000 km"]
["CITROEN","e-SpaceTourer (Shine) XL \n(Batterie 50kWh)","CITROEN e-SpaceTourer (Shine) XL \n(Batterie 50kWh)","EV",100,"Elektrizität",23.9,null,0,null,null,66700,null,"Info zur Akkugarantie: 8 Jahre bis 160.000 km"]
["CITROEN","e-SpaceTourer (Shine) XL \n(Batterie 75kWh)","CITROEN e-SpaceTourer (Shine) XL \n(Batterie 75kWh)","EV",100,"Elektrizität",25.9,null,0,null,null,72700,null,"Info zur Akkugarantie: 8 Jahre bis 160.000 km"]
["CITROEN","e-SpaceTourer (Business) M \n(Batterie 50kWh)","CITROEN e-SpaceTourer (Business) M \n(Batterie 50kWh)","EV",100,"Elektrizität",23.9,null,0,null,null,57350,null,"Info zur Akkugarantie: 8 Jahre bis 160.000 km"]
["CITROEN","e-SpaceTourer (Business) M \n(Batterie 75kWh)",{"$f":"CONCATENATE(A38,\" \",B38)","v":"CITROEN e-SpaceTourer (Business) M \n(Batterie 75kWh)"},"EV",100,"Elektrizität",25.9,null,0,null,null,63350,null,"Info zur Akkugarantie: 8 Jahre bis 160.000 km"]
["CITROEN","e-SpaceTourer (Business) XL \n(Batterie 50kWh)","CITROEN e-SpaceTourer (Business) XL \n(Batterie 50kWh)","EV",100,"Elektrizität",23.9,null,0,null,null,57850,null,"Info zur Akkugarantie: 8 Jahre bis 160.000 km"]
["CITROEN","e-SpaceTourer (Business) XL \n(Batterie 75kWh)","CITROEN e-SpaceTourer (Business) XL \n(Batterie 75kWh)","EV",100,"Elektrizität",25.9,null,0,null,null,63850,null,"Info zur Akkugarantie: 8 Jahre bis 160.000 km"]
["CITROEN","e-SpaceTourer (Business Lounge) M \n(Batterie 75kWh)",{"$f":"CONCATENATE(A41,\" \",B41)","v":"CITROEN e-SpaceTourer (Business Lounge) M \n(Batterie 75kWh)"},"EV",100,"Elektrizität",25.9,null,0,null,null,71400,null,"Info zur Akkugarantie: 8 Jahre bis 160.000 km"]
["CITROEN","e-SpaceTourer (Business Lounge) XL \n(Batterie 75kWh)","CITROEN e-SpaceTourer (Business Lounge) XL \n(Batterie 75kWh)","EV",100,"Elektrizität",25.9,null,0,null,null,71900,null,"Info zur Akkugarantie: 8 Jahre bis 160.000 km"]
["DS AUTOMOBILES","DS 3 CROSSBACK & E-TENSE (SO CHIC)",{"$f":"CONCATENATE(A43,\" \",B43)","v":"DS AUTOMOBILES DS 3 CROSSBACK & E-TENSE (SO CHIC)"},"EV",100,"Elektrizität",17.8,null,0,null,null,39190,null,"Info zur Akkugarantie: 8 Jahre bis 160.000 km"]
["DS AUTOMOBILES","DS 3 CROSSBACK & E-TENSE (PERFORMANCE LINE)",{"$f":"CONCATENATE(A44,\" \",B44)","v":"DS AUTOMOBILES DS 3 CROSSBACK & E-TENSE (PERFORMANCE LINE)"},"EV",100,"Elektrizität",17.8,null,0,null,null,39740,null,"Info zur Akkugarantie: 8 Jahre bis 160.000 km"]
["FIAT","500 electric HATCHBACK (Action)","FIAT 500 electric HATCHBACK (Action)","EV",70,"Elektrizität",13,null,0,null,null,24990,null,"Info zur Akkugarantie: 8 Jahre bis 160.000 km"]
["FIAT","500 electric HATCHBACK (Passion)",{"$f":"CONCATENATE(A46,\" \",B46)","v":"FIAT 500 electric HATCHBACK (Passion)"},"EV",87,"Elektrizität",14.5,null,0,null,null,28390,null,"Info zur Akkugarantie: 8 Jahre bis 160.000 km"]
["FIAT","500 electric HATCHBACK (Icon)",{"$f":"CONCATENATE(A47,\" \",B47)","v":"FIAT 500 electric HATCHBACK (Icon)"},"EV",87,"Elektrizität",14.5,null,0,null,null,29990,null,"Info zur Akkugarantie: 8 Jahre bis 160.000 km"]
["FIAT","500 electric HATCHBACK (La Prima)",{"$f":"CONCATENATE(A48,\" \",B48)","v":"FIAT 500 electric HATCHBACK (La Prima)"},"EV",87,"Elektrizität",14.5,null,0,null,null,35490,null,"Info zur Akkugarantie: 8 Jahre bis 160.000 km"]
["FIAT","500 electric 3+1 (Passion)","FIAT 500 electric 3+1 (Passion)","EV",87,"Elektrizität",14.5,null,0,null,null,30390,null,"Info zur Akkugarantie: 8 Jahre bis 160.000 km"]
["FIAT","500 electric 3+1 (Icon)","FIAT 500 electric 3+1 (Icon)","EV",87,"Elektrizität",14.5,null,0,null,null,31990,null,"Info zur Akkugarantie: 8 Jahre bis 160.000 km"]
["FIAT","500 electric 3+1 (La Prima)",{"$f":"CONCATENATE(A51,\" \",B51)","v":"FIAT 500 electric 3+1 (La Prima)"},"EV",87,"Elektrizität",14.5,null,0,null,null,37490,null,"Info zur Akkugarantie: 8 Jahre bis 160.000 km"]
["FIAT","500 electric Cabrio (Passion)","FIAT 500 electric Cabrio (Passion)","EV",87,"Elektrizität",14.5,null,0,null,null,31390,null,"Info zur Akkugarantie: 8 Jahre bis 160.000 km"]
["FIAT","500 electric Cabrio (Icon)","FIAT 500 electric Cabrio (Icon)","EV",87,"Elektrizität",14.5,null,0,null,null,32990,null,"Info zur Akkugarantie: 8 Jahre bis 160.000 km"]
["FIAT","500 electric Cabrio (La Prima)",{"$f":"CONCATENATE(A54,\" \",B54)","v":"FIAT 500 electric Cabrio (La Prima)"},"EV",87,"Elektrizität",14.5,null,0,null,null,38490,null,"Info zur Akkugarantie: 8 Jahre bis 160.000 km"]
["FORD","Mustang Mach-E (Batterie Standard Range)","FORD Mustang Mach-E (Batterie Standard Range)","EV",198,"Elektrizität",17.2,null,0,null,null,46900]
["FORD","Mustang Mach-E (Batterie Extended Range)",{"$f":"CONCATENATE(A56,\" \",B56)","v":"FORD Mustang Mach-E (Batterie Extended Range)"},"EV",216,"Elektrizität",16.5,null,0,null,null,54475]
["FORD","Mustang Mach-E AWD (Batterie Standard Range)","FORD Mustang Mach-E AWD (Batterie Standard Range)","EV",198,"Elektrizität",19.5,null,0,null,null,54000]
["FORD","Mustang Mach-E AWD (Batterie Extended Range)",{"$f":"CONCATENATE(A58,\" \",B58)","v":"FORD Mustang Mach-E AWD (Batterie Extended Range)"},"EV",258,"Elektrizität",18.7,null,0,null,null,62900]
["HONDA","Honda e",{"$f":"CONCATENATE(A59,\" \",B59)","v":"HONDA Honda e"},"EV",100,"Elektrizität",17.2,null,0,null,null,35690,null,"Info zur Akkugarantie: 8 Jahre bis 160.000 km"]
["HONDA","Honda e Advance","HONDA Honda e Advance","EV",113,"Elektrizität",17.2,null,0,null,null,38690,null,"Info zur Akkugarantie: 8 Jahre bis 160.000 km"]
["HYUNDAI","IONIQ Elektro (LEVEL 3)","HYUNDAI IONIQ Elektro (LEVEL 3)","EV",100,"Elektrizität",13.8,null,0,null,null,37490,null,"Info zur Akkugarantie: 8 Jahre bis 200.000 km","2017 ok"]
["HYUNDAI","IONIQ Elektro (LEVEL 4)","HYUNDAI IONIQ Elektro (LEVEL 4)","EV",100,"Elektrizität",13.8,null,0,null,null,39490,null,"Info zur Akkugarantie: 8 Jahre bis 200.000 km","2017 ok"]
["HYUNDAI","IONIQ Elektro (LEVEL 5)","HYUNDAI IONIQ Elektro (LEVEL 5)","EV",100,"Elektrizität",13.8,null,0,null,null,40990,null,"Info zur Akkugarantie: 8 Jahre bis 200.000 km"]
["HYUNDAI","IONIQ Elektro (LEVEL 6)","HYUNDAI IONIQ Elektro (LEVEL 6)","EV",100,"Elektrizität",13.8,null,0,null,null,42490,null,"Info zur Akkugarantie: 8 Jahre bis 200.000 km"]
["HYUNDAI","KONA LEVEL 3 (39,2 kWh)","HYUNDAI KONA LEVEL 3 (39,2 kWh)","EV",100,"Elektrizität",15,null,0,null,null,39990,null,"Info zur Akkugarantie: 8 Jahre bis 160.000 km"]
["HYUNDAI","KONA LEVEL 4 (39,2 kWh)","HYUNDAI KONA LEVEL 4 (39,2 kWh)","EV",100,"Elektrizität",15,null,0,null,null,42290,null,"Info zur Akkugarantie: 8 Jahre bis 160.000 km"]
["HYUNDAI","KONA LEVEL 4 (64 kWh)","HYUNDAI KONA LEVEL 4 (64 kWh)","EV",150,"Elektrizität",15.4,null,0,null,null,46790,null,"Info zur Akkugarantie: 8 Jahre bis 160.000 km"]
["HYUNDAI","KONA LEVEL 5 (39,2 kWh)","HYUNDAI KONA LEVEL 5 (39,2 kWh)","EV",100,"Elektrizität",15,null,0,null,null,45290,null,"Info zur Akkugarantie: 8 Jahre bis 160.000 km"]
["HYUNDAI","KONA LEVEL 5 (64 kWh)","HYUNDAI KONA LEVEL 5 (64 kWh)","EV",150,"Elektrizität",15.4,null,0,null,null,49790,null,"Info zur Akkugarantie: 8 Jahre bis 160.000 km"]
["HYUNDAI","KONA LEVEL 6 (64 kWh)","HYUNDAI KONA LEVEL 6 (64 kWh)","EV",150,"Elektrizität",15.4,null,0,null,null,51290,null,"Info zur Akkugarantie: 8 Jahre bis 160.000 km"]
["JAGUAR","I-PACE AUSTRIA EDITION","JAGUAR I-PACE AUSTRIA EDITION","EV",235,"Elektrizität",23.4,null,0,null,null,59900,null,"Info zur Akkugarantie: 8 Jahre bis 160.000 km"]
["JAGUAR","I-PACE S","JAGUAR I-PACE S","EV",294,"Elektrizität",23.4,null,0,null,null,79700,null,"Info zur Akkugarantie: 8 Jahre bis 160.000 km"]
["JAGUAR","I-PACE SE","JAGUAR I-PACE SE","EV",294,"Elektrizität",23.4,null,0,null,null,87850,null,"Info zur Akkugarantie: 8 Jahre bis 160.000 km"]
["JAGUAR","I-PACE HSE","JAGUAR I-PACE HSE","EV",294,"Elektrizität",23.4,null,0,null,null,94700,null,"Info zur Akkugarantie: 8 Jahre bis 160.000 km"]
["KIA","e-Niro (TITAN)","KIA e-Niro (TITAN)","EV",100,"Elektrizität",15.3,null,0,null,null,37990,null,"Info zur Akkugarantie: 7 Jahre bis 150.000 km"]
["KIA","e-Niro Long Range (TITAN)","KIA e-Niro Long Range (TITAN)","EV",150,"Elektrizität",15.9,null,0,null,null,42390,null,"Info zur Akkugarantie: 7 Jahre bis 150.000 km",null,null,null,null,null,null,null,null,null,null,null,null,null,null,null,null,null,null,null,null,null,null,null,null,null,null,null,"Batteriemiete und Berechnung \"Renault Zoe - 40kWh/50 Batterie\""]
["KIA","e-Niro (SILBER)","KIA e-Niro (SILBER)","EV",100,"Elektrizität",15.3,null,0,null,null,41190,null,"Info zur Akkugarantie: 7 Jahre bis 150.000 km",null,null,null,null,null,null,null,null,null,null,null,null,null,null,null,null,null,null,null,null,null,null,null,null,null,{"$f":"VLOOKUP(AO77,AP77:AU80,IF(AV82+1<=1,6,AV82+1),TRUE)","v":99},{"$f":"IF(Eingabe!$G$14<='Daten-Elektrofahrzeug'!AP78,'Daten-Elektrofahrzeug'!AP78,IF(Eingabe!$G$14<='Daten-Elektrofahrzeug'!AP79,'Daten-Elektrofahrzeug'!AP79,'Daten-Elektrofahrzeug'!AP80))","v":36},"Vertragslaufzeit",7500,10000,12500,15000,17500]
["KIA","e-Niro Long Range (SILBER)","KIA e-Niro Long Range (SILBER)","EV",150,"Elektrizität",15.9,null,0,null,null,45590,null,"Info zur Akkugarantie: 7 Jahre bis 150.000 km",null,null,null,null,null,null,null,null,null,null,null,null,null,null,null,null,null,null,null,null,null,null,null,null,null,null,null,12,74,84,94,104,114]
["KIA","e-Niro (GOLD)","KIA e-Niro (GOLD)","EV",100,"Elektrizität",15.3,null,0,null,null,43390,null,"Info zur Akkugarantie: 7 Jahre bis 150.000 km",null,null,null,null,null,null,null,null,null,null,null,null,null,null,null,null,null,null,null,null,null,null,null,null,null,null,null,24,69,79,89,99,109]
["KIA","e-Niro Long Range (GOLD)","KIA e-Niro Long Range (GOLD)","EV",150,"Elektrizität",15.9,null,0,null,null,47790,null,"Info zur Akkugarantie: 7 Jahre bis 150.000 km",null,null,null,null,null,null,null,null,null,null,null,null,null,null,null,null,null,null,null,null,null,null,null,null,null,null,null,36,69,79,89,99,109]
["KIA","e-Niro (PLATIN)","KIA e-Niro (PLATIN)","EV",100,"Elektrizität",15.3,null,0,null,null,45190,null,"Info zur Akkugarantie: 7 Jahre bis 150.000 km",null,null,null,null,null,null,null,null,null,null,null,null,null,null,null,null,null,null,"Batteriemiete und Berechnung \"Nissan ev200\"",null,null,null,null,null,null,null,null,null,{"$f":"IF(AND(Eingabe!$G$7<=AQ77),AQ77)","v":false},{"$f":"IF(AND(Eingabe!$G$7<=AR77,Eingabe!$G$7>AQ77),AR77)","v":false},{"$f":"IF(AND(Eingabe!$G$7<=AS77,Eingabe!$G$7>AR77),AS77)","v":false},{"$f":"IF(AND(Eingabe!$G$7<=AT77,Eingabe!$G$7>AS77),AT77)","v":15000},{"$f":"IF(AND(Eingabe!$G$7<=AU77,Eingabe!$G$7>AT77),AU77)","v":false}]
["KIA","e-Niro Long Range (PLATIN)","KIA e-Niro Long Range (PLATIN)","EV",150,"Elektrizität",15.9,null,0,null,null,49590,null,"Info zur Akkugarantie: 7 Jahre bis 150.000 km","2017 ok",null,null,null,null,null,null,null,null,null,null,null,null,null,null,null,{"$f":"VLOOKUP(AF82,AG82:AK85,IF(AL87+1<=1,5,AL87+1),TRUE)","v":91.2},{"$f":"IF(Eingabe!G14<='Daten-Elektrofahrzeug'!AG83,'Daten-Elektrofahrzeug'!AG83,IF(Eingabe!G14<='Daten-Elektrofahrzeug'!AG84,'Daten-Elektrofahrzeug'!AG84,'Daten-Elektrofahrzeug'!AG85))","v":36},"Vertragslaufzeit",10000,15000,20000,25000,null,null,null,null,null,{"$f":"IF(AQ81=AQ77,1,0)","v":0},{"$f":"IF(AR81=AR77,2,0)","v":0},{"$f":"IF(AS81=AS77,3,0)","v":0},{"$f":"IF(AT81=AT77,4,0)","v":4},{"$f":"IF(AU81=AU77,5,0)","v":0},{"$f":"SUM(AQ82:AU82)","v":4}]
["KIA","e-Soul (TITAN)","KIA e-Soul (TITAN)","EV",100,"Elektrizität",15.6,null,0,null,null,34990,null,"Info zur Akkugarantie: 7 Jahre bis 150.000 km","2017 ok",null,null,null,null,null,null,null,null,null,null,null,null,null,null,null,null,null,12,111.6,115.2,132,151.19999999999999,null,null,null,null,"220d 2C31 + 7LC 140/190 5% 4,4 115 EU6 30.300,00 37.475,- 180,-"]
["KIA","e-Soul Long Range (TITAN)","KIA e-Soul Long Range (TITAN)","EV",150,"Elektrizität",15.7,null,0,null,null,39390,null,"Info zur Akkugarantie: 7 Jahre bis 150.000 km",null,null,null,null,null,null,null,null,null,null,null,null,null,null,null,null,null,null,24,99.6,103.2,120,139.19999999999999,null,null,null,null,"Österreich-Paket Plus 5% 1.000,00 1.250,-"]
["KIA","e-Soul (SILBER)","KIA e-Soul (SILBER)","EV",100,"Elektrizität",15.6,null,0,null,null,37990,null,"Info zur Akkugarantie: 7 Jahre bis 150.000 km",null,null,null,null,null,null,null,null,null,null,null,null,null,null,null,null,null,null,36,87.6,91.2,108,127.2]
["KIA","e-Soul Long Range (SILBER)","KIA e-Soul Long Range (SILBER)","EV",150,"Elektrizität",15.7,null,0,null,null,42390,null,"Info zur Akkugarantie: 7 Jahre bis 150.000 km",null,null,null,null,null,null,null,null,null,null,null,null,null,null,null,null,null,null,null,{"$f":"IF(AND(Eingabe!$G$7<=AH82),AH82)","v":false},{"$f":"IF(AND(Eingabe!$G$7<=AI82,Eingabe!$G$7>AH82),AI82)","v":15000},{"$f":"IF(AND(Eingabe!$G$7<=AJ82,Eingabe!$G$7>AI82),AJ82)","v":false},{"$f":"IF(AND(Eingabe!$G$7<=AK82,Eingabe!$G$7>AJ82),AK82)","v":false},null,null,null,null,"220d A 2C31 + 7LC + 2TB 140/190 4% 4,3 112 EU6 32.230,00 39.565,- 190,-"]
["KIA","e-Soul (GOLD)","KIA e-Soul (GOLD)","EV",100,"Elektrizität",15.6,null,0,null,null,40690,null,"Info zur Akkugarantie: 7 Jahre bis 150.000 km",null,null,null,null,null,null,null,null,null,null,null,null,null,null,null,null,null,null,null,{"$f":"IF(AH86=AH82,1,0)","v":0},{"$f":"IF(AI86=AI82,2,0)","v":2},{"$f":"IF(AJ86=AJ82,3,0)","v":0},{"$f":"IF(AK86=AK82,4,0)","v":0},{"$f":"SUM(AH87:AK87)","v":2},null,null,null,null,"Österreich-Paket Plus 4% 1.000,00 1.240,-"]
["KIA","e-Soul Long Range (GOLD)","KIA e-Soul Long Range (GOLD)","EV",150,"Elektrizität",15.7,null,0,null,null,45090,null,"Info zur Akkugarantie: 7 Jahre bis 150.000 km",null,null,null,null,null,null,null,null,null,null,null,null,null,null,null,null,null,null,null,null,null,null,null,null,null,null,null,null,"220d xDrive A 2C51 + 7LC + 2TB 140/190 6% 4,6 122 EU6 33.250,48 41.496,- 199,-"]
["KIA","e-Soul (PLATIN)","KIA e-Soul (PLATIN)","EV",100,"Elektrizität",15.6,null,0,null,null,42490,null,"Info zur Akkugarantie: 7 Jahre bis 150.000 km"]
["KIA","e-Soul Long Range (PLATIN)","KIA e-Soul Long Range (PLATIN)","EV",150,"Elektrizität",15.7,null,0,null,null,46890,null,"Info zur Akkugarantie: 7 Jahre bis 150.000 km"]
["MAZDA","MX-30 GTE",{"$f":"CONCATENATE(A91,\" \",B91)","v":"MAZDA MX-30 GTE"},"EV",107,"Elektrizität",19,null,0,null,null,34990,null,"Info zur Akkugarantie: 8 Jahre bis 160.000 km"]
["MAZDA","MX-30 GTE +","MAZDA MX-30 GTE +","EV",107,"Elektrizität",19,null,0,null,null,35990,null,"Info zur Akkugarantie: 8 Jahre bis 160.000 km"]
["Mercedes-Benz","EQC 400 4MATIC","Mercedes-Benz EQC 400 4MATIC","EV",300,"Elektrizität",23.9,null,0,null,null,75620,null,"Info zur Akkugarantie: 8 Jahre bis 160.000 km"]
["Mercedes-Benz","EQA 250","Mercedes-Benz EQA 250","EV",140,"Elektrizität",18.5,null,0,null,null,48590,null,"Info zur Akkugarantie: 8 Jahre bis 160.000 km"]
["MINI","Cooper SE","MINI Cooper SE","EV",135,"Elektrizität",15.6,null,0,null,null,33050,null,"Info zur Akkugarantie: 8 Jahre bis 160.000 km"]
["NISSAN","Leaf Visia","NISSAN Leaf Visia","EV",110,"Elektrizität",17.100000000000001,null,null,null,null,29990,null,"Info zur Akkugarantie: 8 Jahre bis 160.000 km"]
["NISSAN","Leaf Acenta ",{"$f":"CONCATENATE(A97,\" \",B97)","v":"NISSAN Leaf Acenta "},"EV",110,"Elektrizität",17.100000000000001,null,0,"-",0,33200,0,"Info zur Akkugarantie: 8 Jahre bis 160.000 km",null,null,null,null,null,null,null,null,null,null,null,null,null,null,null,null,null,null,null,null,null,null,null,null,null,null,null,null,"Österreich-Paket Plus 6% 1.000,00 1.260,-"]
["NISSAN","Leaf N-Connecta","NISSAN Leaf N-Connecta","EV",110,"Elektrizität",17.100000000000001,null,0,"-",0,34900,0,"Info zur Akkugarantie: 8 Jahre bis 160.000 km"]
["NISSAN","Leaf Tekna ","NISSAN Leaf Tekna ","EV",110,"Elektrizität",17.100000000000001,null,0,"-",0,37050,null,"Info zur Akkugarantie: 8 Jahre bis 160.000 km"]
["NISSAN","Leaf e+ Acenta ",{"$f":"CONCATENATE(A100,\" \",B100)","v":"NISSAN Leaf e+ Acenta "},"EV",160,"Elektrizität",18.5,null,0,"-",0,38350,0,"Info zur Akkugarantie: 8 Jahre bis 160.000 km",null,null,null,null,null,null,null,null,null,null,null,null,null,null,null,null,null,null,null,null,null,null,null,null,null,null,null,null,"Österreich-Paket Plus 6% 1.000,00 1.260,-"]
["NISSAN","Leaf e+ N-Connecta","NISSAN Leaf e+ N-Connecta","EV",160,"Elektrizität",18.5,null,0,"-",0,39900,0,"Info zur Akkugarantie: 8 Jahre bis 160.000 km"]
["NISSAN","Leaf e+ Tekna ","NISSAN Leaf e+ Tekna ","EV",160,"Elektrizität",18.5,null,0,"-",0,42050,null,"Info zur Akkugarantie: 8 Jahre bis 160.000 km"]
["NISSAN","e-NV200 EVALIA 5-Sitzer/7-Sitzer","NISSAN e-NV200 EVALIA 5-Sitzer/7-Sitzer","EV",80,"Elektrizität",25.9,null,0,"-",0,44200,null,"Info zur Akkugarantie: 8 Jahre bis 160.000 km","2017 ok"]
["NISSAN","e-NV200 Kastenwagen 2-Sitzer (PRO)","NISSAN e-NV200 Kastenwagen 2-Sitzer (PRO)","EV",80,"Elektrizität",25.9,null,0,null,null,37200,null,"Info zur Akkugarantie: 8 Jahre bis 160.000 km","2017 ok"]
["NISSAN","e-NV200 Kastenwagen 2-Sitzer (COMFORT)","NISSAN e-NV200 Kastenwagen 2-Sitzer (COMFORT)","EV",80,"Elektrizität",25.9,null,0,null,null,40080,null,"Info zur Akkugarantie: 8 Jahre bis 160.000 km","2017 ok"]
["NISSAN","e-NV200 Kastenwagen 2-Sitzer (COMFORT Kombi)","NISSAN e-NV200 Kastenwagen 2-Sitzer (COMFORT Kombi)","EV",80,"Elektrizität",25.9,null,0,null,null,42520,null,"Info zur Akkugarantie: 8 Jahre bis 160.000 km"]
["NISSAN","e-NV200 Kastenwagen 2-Sitzer (PREMIUM)","NISSAN e-NV200 Kastenwagen 2-Sitzer (PREMIUM)","EV",80,"Elektrizität",25.9,null,0,null,null,41760,null,"Info zur Akkugarantie: 8 Jahre bis 160.000 km","2017 ok"]
["OPEL","Corsa-e-EDITION","OPEL Corsa-e-EDITION","EV",100,"Elektrizität",16.8,null,0,null,null,29999,null,"Info zur Akkugarantie: 8 Jahre bis 160.000 km","2017 ok"]
["OPEL","Corsa-e-ELEGANCE","OPEL Corsa-e-ELEGANCE","EV",100,"Elektrizität",16.8,null,0,null,null,31699,null,"Info zur Akkugarantie: 8 Jahre bis 160.000 km"]
["OPEL","Corsa-e-GS-LINE",{"$f":"CONCATENATE(A110,\" \",B110)","v":"OPEL Corsa-e-GS-LINE"},"EV",100,"Elektrizität",16.8,null,0,null,null,31799,null,"Info zur Akkugarantie: 8 Jahre bis 160.000 km"]
["OPEL","Mokka-e","OPEL Mokka-e","EV",100,"Elektrizität",17.600000000000001,null,0,null,null,34439,null,"Info zur Akkugarantie: 8 Jahre bis 160.000 km"]
["OPEL","Mokka-e-EDITION","OPEL Mokka-e-EDITION","EV",100,"Elektrizität",17.600000000000001,null,0,null,null,35039,null,"Info zur Akkugarantie: 8 Jahre bis 160.000 km"]
["OPEL","Mokka-e-ELEGANCE","OPEL Mokka-e-ELEGANCE","EV",100,"Elektrizität",17.600000000000001,null,0,null,null,37339,null,"Info zur Akkugarantie: 8 Jahre bis 160.000 km"]
["OPEL","Mokka-e-GS-LINE","OPEL Mokka-e-GS-LINE","EV",100,"Elektrizität",17.600000000000001,null,0,null,null,38719,null,"Info zur Akkugarantie: 8 Jahre bis 160.000 km"]
["OPEL","Mokka-e-ULTIMATE","OPEL Mokka-e-ULTIMATE","EV",100,"Elektrizität",17.600000000000001,null,0,null,null,40849,null,"Info zur Akkugarantie: 8 Jahre bis 160.000 km"]
["OPEL","Zafira-e-Edition (50 kWh) Länge S","OPEL Zafira-e-Edition (50 kWh) Länge S","EV",100,"Elektrizität",23.9,null,0,null,null,58750,null,"Info zur Akkugarantie: 8 Jahre bis 160.000 km"]
["OPEL","Zafira-e-Edition (50 kWh) Länge M",{"$f":"CONCATENATE(A117,\" \",B117)","v":"OPEL Zafira-e-Edition (50 kWh) Länge M"},"EV",100,"Elektrizität",23.9,null,0,null,null,59700,null,"Info zur Akkugarantie: 8 Jahre bis 160.000 km"]
["OPEL","Zafira-e-Edition (50 kWh) Länge L","OPEL Zafira-e-Edition (50 kWh) Länge L","EV",100,"Elektrizität",23.9,null,0,null,null,60200,null,"Info zur Akkugarantie: 8 Jahre bis 160.000 km"]
["OPEL","Zafira-e-Edition (75 kWh) Länge S","OPEL Zafira-e-Edition (75 kWh) Länge S","EV",100,"Elektrizität",25.9,null,0,null,null,"-",null,"Info zur Akkugarantie: 8 Jahre bis 160.000 km"]
["OPEL","Zafira-e-Edition (75 kWh) Länge M",{"$f":"CONCATENATE(A120,\" \",B120)","v":"OPEL Zafira-e-Edition (75 kWh) Länge M"},"EV",100,"Elektrizität",25.9,null,0,null,null,65700,null,"Info zur Akkugarantie: 8 Jahre bis 160.000 km"]
["OPEL","Zafira-e-Edition (75 kWh) Länge L","OPEL Zafira-e-Edition (75 kWh) Länge L","EV",100,"Elektrizität",25.9,null,0,null,null,66200,null,"Info zur Akkugarantie: 8 Jahre bis 160.000 km"]
["OPEL","Zafira-e-Elegance (50 kWh) Länge S",{"$f":"CONCATENATE(A122,\" \",B122)","v":"OPEL Zafira-e-Elegance (50 kWh) Länge S"},"EV",100,"Elektrizität",23.9,null,0,null,null,"-",null,"Info zur Akkugarantie: 8 Jahre bis 160.000 km"]
["OPEL","Zafira-e-Elegance (50 kWh) Länge M","OPEL Zafira-e-Elegance (50 kWh) Länge M","EV",100,"Elektrizität",23.9,null,0,null,null,67210,null,"Info zur Akkugarantie: 8 Jahre bis 160.000 km"]
["OPEL","Zafira-e-Elegance (50 kWh) Länge L","OPEL Zafira-e-Elegance (50 kWh) Länge L","EV",100,"Elektrizität",23.9,null,0,null,null,67710,null,"Info zur Akkugarantie: 8 Jahre bis 160.000 km"]
["OPEL","Zafira-e-Elegance (75 kWh) Länge S",{"$f":"CONCATENATE(A125,\" \",B125)","v":"OPEL Zafira-e-Elegance (75 kWh) Länge S"},"EV",100,"Elektrizität",25.9,null,0,null,null,"-",null,"Info zur Akkugarantie: 8 Jahre bis 160.000 km"]
["OPEL","Zafira-e-Elegance (75 kWh) Länge M","OPEL Zafira-e-Elegance (75 kWh) Länge M","EV",100,"Elektrizität",25.9,null,0,null,null,73210,null,"Info zur Akkugarantie: 8 Jahre bis 160.000 km"]
["OPEL","Zafira-e-Elegance (75 kWh) Länge L","OPEL Zafira-e-Elegance (75 kWh) Länge L","EV",100,"Elektrizität",25.9,null,0,null,null,73710,null,"Info zur Akkugarantie: 8 Jahre bis 160.000 km"]
["OPEL","Zafira-e-Business Edition (50 kWh) Länge S","OPEL Zafira-e-Business Edition (50 kWh) Länge S","EV",100,"Elektrizität",23.9,null,0,null,null,57650,null,"Info zur Akkugarantie: 8 Jahre bis 160.000 km"]
["OPEL","Zafira-e-Business Edition (50 kWh) Länge M","OPEL Zafira-e-Business Edition (50 kWh) Länge M","EV",100,"Elektrizität",23.9,null,0,null,null,58600,null,"Info zur Akkugarantie: 8 Jahre bis 160.000 km"]
["OPEL","Zafira-e-Business Edition (50 kWh) Länge L","OPEL Zafira-e-Business Edition (50 kWh) Länge L","EV",100,"Elektrizität",23.9,null,0,null,null,59100,null,"Info zur Akkugarantie: 8 Jahre bis 160.000 km"]
["OPEL","Zafira-e-Business Edition (75 kWh) Länge S",{"$f":"CONCATENATE(A131,\" \",B131)","v":"OPEL Zafira-e-Business Edition (75 kWh) Länge S"},"EV",100,"Elektrizität",25.9,null,0,null,null,"-",null,"Info zur Akkugarantie: 8 Jahre bis 160.000 km"]
["OPEL","Zafira-e-Business Edition (75 kWh) Länge M","OPEL Zafira-e-Business Edition (75 kWh) Länge M","EV",100,"Elektrizität",25.9,null,0,null,null,64600,null,"Info zur Akkugarantie: 8 Jahre bis 160.000 km"]
["OPEL","Zafira-e-Business Edition (75 kWh) Länge L","OPEL Zafira-e-Business Edition (75 kWh) Länge L","EV",100,"Elektrizität",25.9,null,0,null,null,65100,null,"Info zur Akkugarantie: 8 Jahre bis 160.000 km"]
["OPEL","Zafira-e-Business Elegance Edition (50 kWh) Länge S","OPEL Zafira-e-Business Elegance Edition (50 kWh) Länge S","EV",100,"Elektrizität",23.9,null,0,null,null,"-",null,"Info zur Akkugarantie: 8 Jahre bis 160.000 km"]
["OPEL","Zafira-e-Business Elegance Edition (50 kWh) Länge M","OPEL Zafira-e-Business Elegance Edition (50 kWh) Länge M","EV",100,"Elektrizität",23.9,null,0,null,null,66650,null,"Info zur Akkugarantie: 8 Jahre bis 160.000 km"]
["OPEL","Zafira-e-Business Elegance Edition (50 kWh) Länge L","OPEL Zafira-e-Business Elegance Edition (50 kWh) Länge L","EV",100,"Elektrizität",23.9,null,0,null,null,67150,null,"Info zur Akkugarantie: 8 Jahre bis 160.000 km"]
["OPEL","Zafira-e-Business Elegance Edition (75 kWh) Länge S",{"$f":"CONCATENATE(A137,\" \",B137)","v":"OPEL Zafira-e-Business Elegance Edition (75 kWh) Länge S"},"EV",100,"Elektrizität",25.9,null,0,null,null,"-",null,"Info zur Akkugarantie: 8 Jahre bis 160.000 km"]
["OPEL","Zafira-e-Business Elegance Edition (75 kWh) Länge M","OPEL Zafira-e-Business Elegance Edition (75 kWh) Länge M","EV",100,"Elektrizität",25.9,null,0,null,null,72650,null,"Info zur Akkugarantie: 8 Jahre bis 160.000 km"]
["OPEL","Zafira-e-Business Elegance Edition (75 kWh) Länge L","OPEL Zafira-e-Business Elegance Edition (75 kWh) Länge L","EV",100,"Elektrizität",25.9,null,0,null,null,73150,null,"Info zur Akkugarantie: 8 Jahre bis 160.000 km"]
["PEUGEOT","e-208 (ACTIVE)","PEUGEOT e-208 (ACTIVE)","EV",100,"Elektrizität",16.3,null,0,null,null,32450,null,"Info zur Akkugarantie: 8 Jahre bis 160.000 km"]
["PEUGEOT","e-208 (ACTIVE PACK)",{"$f":"CONCATENATE(A141,\" \",B141)","v":"PEUGEOT e-208 (ACTIVE PACK)"},"EV",100,"Elektrizität",16.3,null,0,null,null,33180,null,"Info zur Akkugarantie: 8 Jahre bis 160.000 km"]
["PEUGEOT","e-208 (ALLURE)","PEUGEOT e-208 (ALLURE)","EV",100,"Elektrizität",16.3,null,0,null,null,33500,null,"Info zur Akkugarantie: 8 Jahre bis 160.000 km"]
["PEUGEOT","e-208 (ALLURE PACK)",{"$f":"CONCATENATE(A143,\" \",B143)","v":"PEUGEOT e-208 (ALLURE PACK)"},"EV",100,"Elektrizität",16.3,null,0,null,null,34000,null,"Info zur Akkugarantie: 8 Jahre bis 160.000 km"]
["PEUGEOT","e-208 (GT)","PEUGEOT e-208 (GT)","EV",100,"Elektrizität",16.3,null,0,null,null,36400,null,"Info zur Akkugarantie: 8 Jahre bis 160.000 km"]
["PEUGEOT","e-208 (GT PACK)","PEUGEOT e-208 (GT PACK)","EV",100,"Elektrizität",16.3,null,0,null,null,38050,null,"Info zur Akkugarantie: 8 Jahre bis 160.000 km"]
["PEUGEOT","e-2008 (ACTIVE)","PEUGEOT e-2008 (ACTIVE)","EV",100,"Elektrizität",17.8,null,0,null,null,38500,null,"Info zur Akkugarantie: 8 Jahre bis 160.000 km"]
["PEUGEOT","e-2008 (ACTIVE PACK)",{"$f":"CONCATENATE(A147,\" \",B147)","v":"PEUGEOT e-2008 (ACTIVE PACK)"},"EV",100,"Elektrizität",17.8,null,0,null,null,38950,null,"Info zur Akkugarantie: 8 Jahre bis 160.000 km"]
["PEUGEOT","e-2008 (ALLURE)","PEUGEOT e-2008 (ALLURE)","EV",100,"Elektrizität",17.8,null,0,null,null,39250,null,"Info zur Akkugarantie: 8 Jahre bis 160.000 km"]
["PEUGEOT","e-2008 (ALLURE PACK)",{"$f":"CONCATENATE(A149,\" \",B149)","v":"PEUGEOT e-2008 (ALLURE PACK)"},"EV",100,"Elektrizität",17.8,null,0,null,null,39900,null,"Info zur Akkugarantie: 8 Jahre bis 160.000 km"]
["PEUGEOT","e-2008 (GT)","PEUGEOT e-2008 (GT)","EV",100,"Elektrizität",17.8,null,0,null,null,42150,null,"Info zur Akkugarantie: 8 Jahre bis 160.000 km"]
["PEUGEOT","e-2008 (GT PACK)","PEUGEOT e-2008 (GT PACK)","EV",100,"Elektrizität",17.8,null,0,null,null,43700,null,"Info zur Akkugarantie: 8 Jahre bis 160.000 km",null,null,null,null,null,null,null,null,null,null,null,null,null,null,null,null,null,null,null,null,null,null,null,null,null,null,null,"Batteriemiete und Berechnung \"Renault Kangoo\""]
["PEUGEOT","e-TRAVELLER (ACTIVE) Kompakt L1","PEUGEOT e-TRAVELLER (ACTIVE) Kompakt L1","EV",100,"Elektrizität",23.9,null,0,null,null,57550,null,"Info zur Akkugarantie: 8 Jahre bis 160.000 km"]
["PEUGEOT","e-TRAVELLER (ACTIVE) Standard L2",{"$f":"CONCATENATE(A153,\" \",B153)","v":"PEUGEOT e-TRAVELLER (ACTIVE) Standard L2"},"EV",100,"Elektrizität",23.9,null,0,null,null,58500,null,"Info zur Akkugarantie: 8 Jahre bis 160.000 km"]
["PEUGEOT","e-TRAVELLER (ACTIVE) Lang L3","PEUGEOT e-TRAVELLER (ACTIVE) Lang L3","EV",100,"Elektrizität",25.9,null,0,null,null,65000,null,"Info zur Akkugarantie: 8 Jahre bis 160.000 km"]
["PEUGEOT","e-TRAVELLER (ALLURE) Standard L2 (50 kWh)",{"$f":"CONCATENATE(A155,\" \",B155)","v":"PEUGEOT e-TRAVELLER (ALLURE) Standard L2 (50 kWh)"},"EV",100,"Elektrizität",23.9,null,0,null,null,66250,null,"Info zur Akkugarantie: 8 Jahre bis 160.000 km"]
["PEUGEOT","e-TRAVELLER (ALLURE) Standard L2 (75 kWh)","PEUGEOT e-TRAVELLER (ALLURE) Standard L2 (75 kWh)","EV",100,"Elektrizität",25.9,null,0,null,null,72250,null,"Info zur Akkugarantie: 8 Jahre bis 160.000 km"]
["PEUGEOT","e-TRAVELLER (ALLURE) Lang L3 (50 kWh)","PEUGEOT e-TRAVELLER (ALLURE) Lang L3 (50 kWh)","EV",100,"Elektrizität",25.9,null,0,null,null,66750,null,"Info zur Akkugarantie: 8 Jahre bis 160.000 km"]
["PEUGEOT","e-TRAVELLER (ALLURE) Lang L3 (75 kWh)","PEUGEOT e-TRAVELLER (ALLURE) Lang L3 (75 kWh)","EV",100,"Elektrizität",25.9,null,0,null,null,72750,null,"Info zur Akkugarantie: 8 Jahre bis 160.000 km"]
["PEUGEOT","e-TRAVELLER (BUSINESS) Standard L2 (50 kWh)",{"$f":"CONCATENATE(A159,\" \",B159)","v":"PEUGEOT e-TRAVELLER (BUSINESS) Standard L2 (50 kWh)"},"EV",100,"Elektrizität",23.9,null,0,null,null,57400,null,"Info zur Akkugarantie: 8 Jahre bis 160.000 km"]
["PEUGEOT","e-TRAVELLER (BUSINESS) Standard L2 (75 kWh)","PEUGEOT e-TRAVELLER (BUSINESS) Standard L2 (75 kWh)","EV",100,"Elektrizität",25.9,null,0,null,null,63400,null,"Info zur Akkugarantie: 8 Jahre bis 160.000 km"]
["PEUGEOT","e-TRAVELLER (BUSINESS) Lang L3 (75 kWh)","PEUGEOT e-TRAVELLER (BUSINESS) Lang L3 (75 kWh)","EV",100,"Elektrizität",25.9,null,0,null,null,63900,null,"Info zur Akkugarantie: 8 Jahre bis 160.000 km"]
["PEUGEOT","e-TRAVELLER (BUSINESS VIP) Standard L2 (75 kWh)",{"$f":"CONCATENATE(A162,\" \",B162)","v":"PEUGEOT e-TRAVELLER (BUSINESS VIP) Standard L2 (75 kWh)"},"EV",100,"Elektrizität",25.9,null,0,null,null,71450,null,"Info zur Akkugarantie: 8 Jahre bis 160.000 km"]
["PEUGEOT","e-TRAVELLER (BUSINESS VIP) Lang L3 (75 kWh)","PEUGEOT e-TRAVELLER (BUSINESS VIP) Lang L3 (75 kWh)","EV",100,"Elektrizität",25.9,null,0,null,null,71950,null,"Info zur Akkugarantie: 8 Jahre bis 160.000 km"]
["PORSCHE","Taycan ","PORSCHE Taycan ","EV",280,"Elektrizität",28.7,null,0,null,null,86868,null,"Info zur Akkugarantie: 8 Jahre bis 160.000 km"]
["PORSCHE","Taycan 4S","PORSCHE Taycan 4S","EV",360,"Elektrizität",23.4,null,0,null,null,110034,null,"Info zur Akkugarantie: 8 Jahre bis 160.000 km"]
["PORSCHE","Taycan Turbo","PORSCHE Taycan Turbo","EV",500,"Elektrizität",24.9,null,0,null,null,157050,null,"Info zur Akkugarantie: 8 Jahre bis 160.000 km"]
["PORSCHE","Taycan Turbo S","PORSCHE Taycan Turbo S","EV",560,"Elektrizität",25.1,null,0,null,null,190571,null,"Info zur Akkugarantie: 8 Jahre bis 160.000 km",null,null,null,null,null,null,null,null,null,null,null,null,null,null,null,null,null,null,null,null,null,null,null,null,null,{"$f":"VLOOKUP(AO167,AP167:AV171,IF(AV184+1<=1,6,AV184+1),TRUE)","v":{"$error":"#REF!"}},{"$f":"IF(Eingabe!$G$14<='Daten-Elektrofahrzeug'!AP168,'Daten-Elektrofahrzeug'!AP168,IF(Eingabe!$G$14<=AP170,AP170,AP171))","v":36},"Vertragslaufzeit",7500,10000,12500,15000,17500,20000]
["RENAULT","ZOE LIFE R110 Z.E. 40","RENAULT ZOE LIFE R110 Z.E. 40","EV",80,"Elektrizität",17.600000000000001,null,0,null,null,30890,null,"Info zur Akkugarantie: 8 Jahre bis 160.000 km",null,null,null,null,null,null,null,null,null,null,null,null,null,null,null,null,null,null,null,null,null,null,null,null,null,null,null,12,58,66,74,82,90,98]
["RENAULT","ZOE LIFE R110 Z.E. 50",{"$f":"CONCATENATE(A169,\" \",B169)","v":"RENAULT ZOE LIFE R110 Z.E. 50"},"EV",80,"Elektrizität",17.600000000000001,null,0,null,null,33390,null,"Info zur Akkugarantie: 8 Jahre bis 160.000 km",null,null,null,null,null,null,null,null,null,null,null,null,null,null,null,null,null,null,null,null,null,null,null,null,null,null,null,12,58,66,74,82,90,98]
["RENAULT","ZOE ZEN R110","RENAULT ZOE ZEN R110","EV",80,"Elektrizität",17.600000000000001,null,0,null,null,34290,null,"Info zur Akkugarantie: 8 Jahre bis 160.000 km",null,null,null,null,null,null,null,null,null,null,null,null,null,null,null,null,null,null,null,null,null,null,null,null,null,null,null,24,58,66,74,82,90,98]
["RENAULT","ZOE ZEN R135","RENAULT ZOE ZEN R135","EV",100,"Elektrizität",18.5,null,0,null,null,35290,null,"Info zur Akkugarantie: 8 Jahre bis 160.000 km",null,null,null,null,null,null,null,null,null,null,null,null,null,null,null,null,null,null,null,null,null,null,null,null,null,null,null,36,58,66,74,82,90,98]
["RENAULT","ZOE INTENS R135","RENAULT ZOE INTENS R135","EV",100,"Elektrizität",18.5,null,0,null,null,36990,null,"Info zur Akkugarantie: 8 Jahre bis 160.000 km",null,null,null,null,null,null,null,null,null,null,null,null,null,null,null,null,null,null,null,null,null,null,null,null,null,null,null,null,{"$f":"IF(AND(Eingabe!$G$7<=AQ167),AQ167)","v":false},{"$f":"IF(AND(Eingabe!$G$7<=AR167,Eingabe!$G$7>AQ167),AR167)","v":false},{"$f":"IF(AND(Eingabe!$G$7<=AS167,Eingabe!$G$7>AR167),AS167)","v":false},{"$f":"IF(AND(Eingabe!$G$7<=AT167,Eingabe!$G$7>AS167),AT167)","v":15000},{"$f":"IF(AND(Eingabe!$G$7<=AU167,Eingabe!$G$7>AT167),AU167)","v":false},{"$f":"IF(AND(Eingabe!$G$7<=AV167,Eingabe!$G$7>AU167),AV167)","v":false}]
["RENAULT","ZOE RIVIERA R135",{"$f":"CONCATENATE(A173,\" \",B173)","v":"RENAULT ZOE RIVIERA R135"},"EV",100,"Elektrizität",18.5,null,0,null,null,38690,null,"Info zur Akkugarantie: 8 Jahre bis 160.000 km",null,null,null,null,null,null,null,null,null,null,null,null,null,null,null,null,null,null,null,null,null,null,null,null,null,null,null,null,{"$f":"IF(AND(Eingabe!$G$7<=AQ168),AQ168)","v":false},{"$f":"IF(AND(Eingabe!$G$7<=AR168,Eingabe!$G$7>AQ168),AR168)","v":false},{"$f":"IF(AND(Eingabe!$G$7<=AS168,Eingabe!$G$7>AR168),AS168)","v":false},{"$f":"IF(AND(Eingabe!$G$7<=AT168,Eingabe!$G$7>AS168),AT168)","v":false},{"$f":"IF(AND(Eingabe!$G$7<=AU168,Eingabe!$G$7>AT168),AU168)","v":false},{"$f":"IF(AND(Eingabe!$G$7<=AV168,Eingabe!$G$7>AU168),AV168)","v":false}]
["RENAULT","Kangoo Z.E. COMPLETE 2-Sitzer",{"$f":"CONCATENATE(A174,\" \",B174)","v":"RENAULT Kangoo Z.E. COMPLETE 2-Sitzer"},"EV",44,"Elektrizität",12.3,null,0,null,null,33880,null,"Info zur Akkugarantie: 5 Jahre bis 100.000 km","2017 ok",null,null,null,null,null,null,null,null,null,null,null,null,null,null,null,null,null,null,null,null,null,null,null,null,null,null,null,{"$f":"IF(#REF!=AQ170,1,0)","v":{"$error":"#REF!"}},{"$f":"IF(#REF!=AR170,2,0)","v":{"$error":"#REF!"}},{"$f":"IF(#REF!=AS170,3,0)","v":{"$error":"#REF!"}},{"$f":"IF(#REF!=AT170,4,0)","v":{"$error":"#REF!"}},{"$f":"IF(#REF!=AU170,5,0)","v":{"$error":"#REF!"}},{"$f":"IF(#REF!=AV170,5,0)","v":{"$error":"#REF!"}}]
["RENAULT","Kangoo Maxi Z.E. COMPLETE 2-Sitzer","RENAULT Kangoo Maxi Z.E. COMPLETE 2-Sitzer","EV",44,"Elektrizität",12.3,null,0,null,null,35320,null,"Info zur Akkugarantie: 5 Jahre bis 100.000 km","2017 ok"]
["RENAULT","Kangoo Maxi Z.E. COMPLETE 5-Sitzer","RENAULT Kangoo Maxi Z.E. COMPLETE 5-Sitzer","EV",44,"Elektrizität",12.3,null,0,null,null,36280,null,"Info zur Akkugarantie: 5 Jahre bis 100.000 km"]
["RENAULT","Master Z.E. Kastenwagen L1H1 3-Sitzer","RENAULT Master Z.E. Kastenwagen L1H1 3-Sitzer","EV",57,"Elektrizität",21,null,0,null,null,63960,null,"Info zur Akkugarantie: 5 Jahre bis 100.000 km"]
["RENAULT","Master Z.E. Kastenwagen L1H2 3-Sitzer","RENAULT Master Z.E. Kastenwagen L1H2 3-Sitzer","EV",57,"Elektrizität",21,null,0,null,null,64920,null,"Info zur Akkugarantie: 5 Jahre bis 100.000 km"]
["RENAULT","Master Z.E. Kastenwagen L1H2 3-Sitzer",{"$f":"CONCATENATE(A179,\" \",B179)","v":"RENAULT Master Z.E. Kastenwagen L1H2 3-Sitzer"},"EV",57,"Elektrizität",21,null,0,null,null,70920,null,"Info zur Akkugarantie: 5 Jahre bis 100.000 km"]
["RENAULT","Master Z.E. Kastenwagen L2H2 3-Sitzer","RENAULT Master Z.E. Kastenwagen L2H2 3-Sitzer","EV",57,"Elektrizität",21,null,0,null,null,65880,null,"Info zur Akkugarantie: 5 Jahre bis 100.000 km"]
["RENAULT","Master Z.E. Kastenwagen L2H2 3-Sitzer",{"$f":"CONCATENATE(A181,\" \",B181)","v":"RENAULT Master Z.E. Kastenwagen L2H2 3-Sitzer"},"EV",57,"Elektrizität",21,null,0,null,null,71880,null,"Info zur Akkugarantie: 5 Jahre bis 100.000 km"]
["RENAULT","Master Z.E. Kastenwagen L3H2 3-Sitzer","RENAULT Master Z.E. Kastenwagen L3H2 3-Sitzer","EV",57,"Elektrizität",21,null,0,null,null,67080,null,"Info zur Akkugarantie: 5 Jahre bis 100.000 km"]
["RENAULT","Master Z.E. Kastenwagen L3H2 3-Sitzer",{"$f":"CONCATENATE(A183,\" \",B183)","v":"RENAULT Master Z.E. Kastenwagen L3H2 3-Sitzer"},"EV",57,"Elektrizität",21,null,0,null,null,73080,null,"Info zur Akkugarantie: 5 Jahre bis 100.000 km"]
["RENAULT","Master Z.E. Plattform L2 3-Sitzer","RENAULT Master Z.E. Plattform L2 3-Sitzer","EV",57,"Elektrizität",21,null,0,null,null,62760,null,"Info zur Akkugarantie: 5 Jahre bis 100.000 km",null,null,null,null,null,null,null,null,null,null,null,null,null,null,null,null,null,null,null,null,null,null,null,null,null,null,null,null,null,null,null,null,null,{"$f":"SUM(#REF!)","v":{"$error":"#REF!"}}]
["RENAULT","Master Z.E. Plattform L2 3-Sitzer",{"$f":"CONCATENATE(A185,\" \",B185)","v":"RENAULT Master Z.E. Plattform L2 3-Sitzer"},"EV",57,"Elektrizität",21,null,0,null,null,68760,null,"Info zur Akkugarantie: 5 Jahre bis 100.000 km",null,null,null,null,null,null,null,null,null,null,null,null,null,null,null,null,null,null,null,null,null,null,null,null,null,null,null,null,null,null,null,null,null,{"$f":"SUM(#REF!)","v":{"$error":"#REF!"}}]
["RENAULT","Master Z.E. Plattform L3 3-Sitzer",{"$f":"CONCATENATE(A186,\" \",B186)","v":"RENAULT Master Z.E. Plattform L3 3-Sitzer"},"EV",57,"Elektrizität",21,null,0,null,null,63960,null,"Info zur Akkugarantie: 5 Jahre bis 100.000 km"]
["RENAULT","Master Z.E. Plattform L3 3-Sitzer",{"$f":"CONCATENATE(A187,\" \",B187)","v":"RENAULT Master Z.E. Plattform L3 3-Sitzer"},"EV",57,"Elektrizität",21,null,0,null,null,69960,null,"Info zur Akkugarantie: 5 Jahre bis 100.000 km"]
["RENAULT","Master Z.E. Fahrgestell L2 3-Sitzer","RENAULT Master Z.E. Fahrgestell L2 3-Sitzer","EV",57,"Elektrizität",21,null,0,null,null,69780,null,"Info zur Akkugarantie: 5 Jahre bis 100.000 km",null,null,null,null,null,null,null,null,null,null,null,null,null,null,null,null,null,null,null,null,null,null,null,null,null,null,null,null,null,null,null,null,null,{"$f":"SUM(#REF!)","v":{"$error":"#REF!"}}]
["RENAULT","Master Z.E. Fahrgestell L3 3-Sitzer",{"$f":"CONCATENATE(A189,\" \",B189)","v":"RENAULT Master Z.E. Fahrgestell L3 3-Sitzer"},"EV",57,"Elektrizität",21,null,0,null,null,70980,null,"Info zur Akkugarantie: 5 Jahre bis 100.000 km",null,null,null,null,null,null,null,null,null,null,null,null,null,null,null,null,null,null,null,null,null,null,null,null,null,null,null,null,null,null,null,null,null,{"$f":"SUM(#REF!)","v":{"$error":"#REF!"}}]
["RENAULT","TWINGO Electric (LIFE)","RENAULT TWINGO Electric (LIFE)","EV",60,"Elektrizität",16,null,0,null,null,20490,null,"Info zur Akkugarantie: 8 Jahre bis 160.000 km"]
["RENAULT","TWINGO Electric (ZEN)",{"$f":"CONCATENATE(A191,\" \",B191)","v":"RENAULT TWINGO Electric (ZEN)"},"EV",60,"Elektrizität",16,null,0,null,null,21990,null,"Info zur Akkugarantie: 8 Jahre bis 160.000 km"]
["RENAULT","TWINGO Electric (INTENS)","RENAULT TWINGO Electric (INTENS)","EV",60,"Elektrizität",16,null,0,null,null,23290,null,"Info zur Akkugarantie: 8 Jahre bis 160.000 km"]
["RENAULT","TWINGO Electric (VIBES)","RENAULT TWINGO Electric (VIBES)","EV",60,"Elektrizität",16,null,0,null,null,24490,null,"Info zur Akkugarantie: 8 Jahre bis 160.000 km"]
["SEAT","Mii electric","SEAT Mii electric","EV",61,"Elektrizität",14.7,null,0,null,null,21490,null,"Info zur Akkugarantie: 8 Jahre bis 160.000 km"]
["SEAT","Mii electric PLUS","SEAT Mii electric PLUS","EV",61,"Elektrizität",14.8,null,0,null,null,22490,null,"Info zur Akkugarantie: 8 Jahre bis 160.000 km","2017 ok"]
["SKODA","CITIGOe iV","SKODA CITIGOe iV","EV",61,"Elektrizität",14.5,null,0,null,null,21350,null,"Info zur Akkugarantie: 8 Jahre bis 160.000 km","2017 ok"]
["SKODA","Enyaq iV 60","SKODA Enyaq iV 60","EV",132,"Elektrizität",15.7,null,0,null,null,39230,null,"Info zur Akkugarantie: 8 Jahre bis 160.000 km"]
["SKODA","Enyaq iV 80",{"$f":"CONCATENATE(A198,\" \",B198)","v":"SKODA Enyaq iV 80"},"EV",150,"Elektrizität",16.7,null,0,null,null,45540,null,"Info zur Akkugarantie: 8 Jahre bis 160.000 km"]
["smart","EQ fortwo","smart EQ fortwo","EV",60,"Elektrizität",16.7,null,0,"-",0,25510,null,"Info zur Akkugarantie: 8 Jahre bis 100.000 km","2017 ok",null,null,null,null,null,null,null,null,null,null,null,null,null,null,null,null,null,null,null,null,null,null,null,null,{"$f":"VLOOKUP(AO199,AP199:AU202,AV211+1,TRUE)","v":106},{"$f":"IF(Eingabe!$G$14<='Daten-Elektrofahrzeug'!AP200,'Daten-Elektrofahrzeug'!AP200,IF(Eingabe!$G$14<='Daten-Elektrofahrzeug'!AP201,'Daten-Elektrofahrzeug'!AP201,'Daten-Elektrofahrzeug'!AP202))","v":36},"Vertragslaufzeit",7500,10000,12500,15000]
["smart","EQ fortwo cabrio","smart EQ fortwo cabrio","EV",60,"Elektrizität",17,null,0,null,null,28820,null,"Info zur Akkugarantie: 8 Jahre bis 100.000 km",null,null,null,null,null,null,null,null,null,null,null,null,null,null,null,null,null,null,null,null,null,null,null,null,null,null,null,12,93,96,110,126]
["smart","EQ forfour","smart EQ forfour","EV",60,"Elektrizität",17.3,null,0,"-",0,26140,null,"Info zur Akkugarantie: 8 Jahre bis 100.000 km",null,null,null,null,null,null,null,null,null,null,null,null,null,null,null,null,null,null,null,null,null,null,null,null,null,null,null,24,83,86,100,116]
["TESLA","Model 3 Maximale Reichweite","TESLA Model 3 Maximale Reichweite","EV","377 oder 324","Elektrizität",null,null,0,null,null,46100,null,"-",null,null,null,null,null,null,null,null,null,null,null,null,null,null,null,null,null,null,null,null,null,null,null,null,null,null,null,36,73,76,90,106]
["TESLA","Model 3 Performance","TESLA Model 3 Performance","EV",377,"Elektrizität",null,null,0,null,null,59990,null,"-","2017 ok",null,null,null,null,null,null,null,null,null,null,null,null,null,null,null,null,null,null,null,null,null,null,null,null,null,null,null,{"$f":"IF(AND(Eingabe!$G$7<=AQ199),AQ199)","v":false},{"$f":"IF(AND(Eingabe!$G$7<=AR199,Eingabe!$G$7>AQ199),AR199)","v":false},{"$f":"IF(AND(Eingabe!$G$7<=AS199,Eingabe!$G$7>AR199),AS199)","v":false},{"$f":"IF(AND(Eingabe!$G$7<=AT199,Eingabe!$G$7>AS199),AT199)","v":15000},{"$f":"IF(AND(Eingabe!$G$7<=AU199,Eingabe!$G$7>AT199),AU199)","v":false}]
["TESLA","Model 3 Standard-Reichweite Plus","TESLA Model 3 Standard-Reichweite Plus","EV",239,"Elektrizität",null,null,0,null,null,54990,null,"-",null,null,null,null,null,null,null,null,null,null,null,null,null,null,null,null,null,null,null,null,null,null,null,null,null,null,null,null,{"$f":"IF(AQ203=AQ199,1,0)","v":0},{"$f":"IF(AR203=AR199,2,0)","v":0},{"$f":"IF(AS203=AS199,3,0)","v":0},{"$f":"IF(AT203=AT199,4,0)","v":4}]
["TESLA","Model S Maximale Reichweite","TESLA Model S Maximale Reichweite","EV",415,"Elektrizität",null,null,0,null,null,89990,null,"-"]
["TESLA","Model S Plaid","TESLA Model S Plaid","EV",580,"Elektrizität",null,null,0,null,null,119990,null,"-"]
["TESLA","Model S Plaid+","TESLA Model S Plaid+","EV",580,"Elektrizität",null,null,0,null,null,139990]
["TESLA","Model X Maximale Reichweite","TESLA Model X Maximale Reichweite","EV",415,"Elektrizität",null,null,0,null,null,99990,null,"-"]
["TESLA","Model X Plaid","TESLA Model X Plaid","EV",580,"Elektrizität",null,null,0,null,null,119990,null,"-"]
["VW"," e-up!","VW  e-up!","EV",61,"Elektrizität",14.7,null,0,0,0,22590,null,"Info zur Akkugarantie: 8 Jahre bis 160.000 km"]
["VW","e-Golf","VW e-Golf","EV",100,"Elektrizität",15.7,null,0,0,0,33990,null,"Info zur Akkugarantie: 8 Jahre bis 160.000 km",null,null,null,null,null,null,null,null,null,null,null,null,null,null,null,null,null,null,null,null,null,null,null,null,null,null,null,null,null,null,null,null,null,{"$f":"SUM(AQ204:AU204)","v":4}]
["VW","ID.3 Pure Performance Upgrade (45 kWh) Basis","VW ID.3 Pure Performance Upgrade (45 kWh) Basis","EV",110,"Elektrizität",15.6,null,0,null,null,33020,null,"Info zur Akkugarantie: 8 Jahre bis 160.000 km"]
["VW","ID.3 Pure Performance Upgrade (45 kWh) City",{"$f":"CONCATENATE(A213,\" \",B213)","v":"VW ID.3 Pure Performance Upgrade (45 kWh) City"},"EV",110,"Elektrizität",15.6,null,0,null,null,35520,null,"Info zur Akkugarantie: 8 Jahre bis 160.000 km"]
["VW","ID.3 Pure Performance Upgrade (45 kWh) Style","VW ID.3 Pure Performance Upgrade (45 kWh) Style","EV",110,"Elektrizität",15.6,null,0,null,null,39430,null,"Info zur Akkugarantie: 8 Jahre bis 160.000 km"]
["VW","ID.3 Pro (58 kWh) Basis","VW ID.3 Pro (58 kWh) Basis","EV",107,"Elektrizität",15.7,null,0,null,null,35420,null,"Info zur Akkugarantie: 8 Jahre bis 160.000 km"]
["VW","ID.3 Pro (58 kWh) Life",{"$f":"CONCATENATE(A216,\" \",B216)","v":"VW ID.3 Pro (58 kWh) Life"},"EV",107,"Elektrizität",15.7,null,0,null,null,38470,null,"Info zur Akkugarantie: 8 Jahre bis 160.000 km"]
["VW","ID.3 Pro (58 kWh) Business","VW ID.3 Pro (58 kWh) Business","EV",107,"Elektrizität",15.7,null,0,null,null,41960,null,"Info zur Akkugarantie: 8 Jahre bis 160.000 km"]
["VW","ID.3 Pro (58 kWh) Family","VW ID.3 Pro (58 kWh) Family","EV",107,"Elektrizität",15.7,null,0,null,null,42970,null,"Info zur Akkugarantie: 8 Jahre bis 160.000 km"]
["VW","ID.3 Pure Performance Upgrade (58 kWh) Basis","VW ID.3 Pure Performance Upgrade (58 kWh) Basis","EV",150,"Elektrizität",16.2,null,0,null,null,36490,null,"Info zur Akkugarantie: 8 Jahre bis 160.000 km"]
["VW","ID.3 Pure Performance Upgrade (58 kWh) Life","VW ID.3 Pure Performance Upgrade (58 kWh) Life","EV",150,"Elektrizität",16.2,null,0,null,null,39540,null,"Info zur Akkugarantie: 8 Jahre bis 160.000 km"]
["VW","ID.3 Pure Performance Upgrade (58 kWh) Business","VW ID.3 Pure Performance Upgrade (58 kWh) Business","EV",150,"Elektrizität",16.2,null,0,null,null,43030,null,"Info zur Akkugarantie: 8 Jahre bis 160.000 km"]
["VW","ID.3 Pure Performance Upgrade (58 kWh) Family","VW ID.3 Pure Performance Upgrade (58 kWh) Family","EV",150,"Elektrizität",16.2,null,0,null,null,44040,null,"Info zur Akkugarantie: 8 Jahre bis 160.000 km"]
["VW","ID.3 Pure Performance Upgrade (58 kWh) Tech",{"$f":"CONCATENATE(A223,\" \",B223)","v":"VW ID.3 Pure Performance Upgrade (58 kWh) Tech"},"EV",150,"Elektrizität",16.2,null,0,null,null,45730,null,"Info zur Akkugarantie: 8 Jahre bis 160.000 km"]
["VW","ID.3 Pure Performance Upgrade (58 kWh) Max","VW ID.3 Pure Performance Upgrade (58 kWh) Max","EV",150,"Elektrizität",16.2,null,0,null,null,47960,null,"Info zur Akkugarantie: 8 Jahre bis 160.000 km"]
["VW","ID.3 Pro S (77 kWh) Basis","VW ID.3 Pro S (77 kWh) Basis","EV",150,"Elektrizität",16.5,null,0,null,null,40360,null,"Info zur Akkugarantie: 8 Jahre bis 160.000 km"]
["VW","ID.3 Pro S (77 kWh) Tour",{"$f":"CONCATENATE(A226,\" \",B226)","v":"VW ID.3 Pro S (77 kWh) Tour"},"EV",150,"Elektrizität",16.5,null,0,null,null,49040,null,"Info zur Akkugarantie: 8 Jahre bis 160.000 km"]
["VW","ID.4 Pro Performance Basis","VW ID.4 Pro Performance Basis","EV",150,"Elektrizität",17.899999999999999,null,0,null,null,43970,null,"Info zur Akkugarantie: 8 Jahre bis 160.000 km"]
["VW","ID.4 Pro Performance Life",{"$f":"CONCATENATE(A228,\" \",B228)","v":"VW ID.4 Pro Performance Life"},"EV",150,"Elektrizität",17.899999999999999,null,0,null,null,45290,null,"Info zur Akkugarantie: 8 Jahre bis 160.000 km"]
["VW","ID.4 Pro Performance Business","VW ID.4 Pro Performance Business","EV",150,"Elektrizität",17.899999999999999,null,0,null,null,49090,null,"Info zur Akkugarantie: 8 Jahre bis 160.000 km"]
["VW","ID.4 Pro Performance Family","VW ID.4 Pro Performance Family","EV",150,"Elektrizität",17.899999999999999,null,0,null,null,50290,null,"Info zur Akkugarantie: 8 Jahre bis 160.000 km"]
["VW","ID.4 Pro Performance Tech","VW ID.4 Pro Performance Tech","EV",150,"Elektrizität",17.899999999999999,null,0,null,null,53490,null,"Info zur Akkugarantie: 8 Jahre bis 160.000 km"]
["VW","ID.4 Pro Performance Max","VW ID.4 Pro Performance Max","EV",150,"Elektrizität",17.899999999999999,null,0,null,null,56790,null,"Info zur Akkugarantie: 8 Jahre bis 160.000 km"]
["eigenes","Fahrzeug","eigenes Fahrzeug","EV",null,"Elektrizität",null,null,0]
["eigenes","Fahrzeug","eigenes Fahrzeug","EV",null,"Elektrizität",null,null,0]
["eigenes","Fahrzeug","eigenes Fahrzeug","EV",null,"Elektrizität",null,null,0]
[]
[null,null,null,null,null,null,null,null,null,null,null,null,null,null,"2017 ok"]
[]
[]
[null,null,null,null,null,null,null,null,null,null,null,null,null,null,"2017 ok"]
[]
[]
[]
[]
[]
[]
[]
[]
[]
[]
[]
[null,null,null,null,null,null,null,null,null,null,null,null,null,null,"2017 ok"]
[null,null,null,null,null,null,null,null,null,null,null,null,null,null,"2017 ok"]
[null,null,null,null,null,null,null,null,null,null,null,null,null,null,"2017 ok"]
[null,null,null,null,null,null,null,null,null,null,null,null,null,null,"2017 ok"]
[null,null,null,null,null,null,null,null,null,null,null,null,null,null,"2017 ok"]
[null,null,null,null,null,null,null,null,null,null,null,null,null,null,"2017 ok"]
[null,null,null,null,null,null,null,null,null,null,null,null,null,null,"2017 ok"]
[null,null,null,null,null,null,null,null,null,null,null,null,null,null,"2017 ok"]
[null,null,null,null,null,null,null,null,null,null,null,null,null,null,"2017 ok"]
[null,null,null,null,null,null,null,null,null,null,null,null,null,null,"2017 ok"]
[]
[null,null,null,null,null,null,null,null,null,null,null,null,null,null,"2017 ok"]
[null,null,null,null,null,null,null,null,null,null,null,null,null,null,"2017 ok"]
[null,null,null,null,null,null,null,null,null,null,null,null,null,null,"2017 ok"]
[null,null,null,null,null,null,null,null,null,null,null,null,null,null,"2017 ok"]
[null,null,null,null,null,null,null,null,null,null,null,null,null,null,"2017 ok"]

{"sheet":"Daten-Benzin-Dieselfahrzeug","index":4,"n_rows":652,"n_cols":35,"rows_kept":652,"cut":false,"hidden":false,"merged":[[2,18,2,19],[3,18,3,19],[2,5,2,6],[1,5,1,6],[0,0,0,2],[1,0,1,2],[2,13,3,13]]}
["Allgemeine Daten Verbrennungskraftfahrzeuge"]
["http://www.topprodukte.at",null,null,null,null,"Kraftstoffverbrauch",null,"CO2-Emissionen"]
["Marke","Modell","Modellauswahl","Leistung","Kraftstoff","kombiniert",null,"kombiniert","Preis","Sachbezug","Lohnnebenkosten","Quelle",null,"* Energieinhalt:",{"$f":"O8*0.72/3600","v":8.5399999999999991},"kWh/liter Benzin",null,null,"Anschaffungsjahr:",null,2021,null,null,"Jahr der Anschaffung","CO2 Grenzwert"]
[null,null,null,"[kW]",null,"kWh/100km*","l/100km","[g/km]","[€]","[€/m]","[€/m]",null,null,null,{"$f":"O9*0.87/3600","v":10.1065},"kWh/liter Diesel",null,null,"CO2 Grenzwert:",null,{"$f":"VLOOKUP(U3,X5:Y15,2,TRUE)","v":138},"[g/km]",null,"[a]","[g/km]"]
[null,null,1,2,3,4,5,6,7,8,9,null,null,null,null,null,null,null,null,null,null,null,null,2016,130,"(NEFZ-Wert)"]
["Eingabe","eigenes Fahrzeug",{"$f":"CONCATENATE(A6,\" \",B6,\" - \",E6)","v":"Eingabe eigenes Fahrzeug - "},null,null,{"$f":"IF(E6=\"Benzin\",$O$3*G6,$O$4*G6)","v":0},null,null,null,{"$f":"IF(H6>$U$4,IF(I6*0.02>960,960,I6*0.02),IF(H6>0,IF(I6*0.015>720,720,I6*0.015),0))","v":0},{"$f":"J6*Eingabe!$C$48","v":0},null,null,null,null,null,null,null,null,null,null,null,null,2017,127,"(NEFZ-Wert)"]
["Eingabe","eigenes Fahrzeug","Eingabe eigenes Fahrzeug - ",null,null,0,null,null,null,{"$f":"IF(H7>$U$4,IF(I7*0.02>960,960,I7*0.02),IF(H7>0,IF(I7*0.015>720,720,I7*0.015),0))","v":0},{"$f":"J7*Eingabe!$C$48","v":0},null,null,null,null,null,null,null,null,null,null,null,null,2018,124,"(NEFZ-Wert)"]
["Eingabe","eigenes Fahrzeug","Eingabe eigenes Fahrzeug - ",null,null,{"$f":"IF(E8=\"Benzin\",$O$3*G8,$O$4*G8)","v":0},null,null,null,{"$f":"IF(H8>$U$4,IF(I8*0.02>960,960,I8*0.02),IF(H8>0,IF(I8*0.015>720,720,I8*0.015),0))","v":0},{"$f":"J8*Eingabe!$C$48","v":0},null,null,"Hu Benzin(Mittelwert) =",42700,"kJ/kg",null,"Benzin",null,null,null,null,null,2019,121,"(NEFZ-Wert)"]
[{"$f":"'topprodukte-benzin-diesel'!A2","v":"Audi"},{"$f":"'topprodukte-benzin-diesel'!B2","v":"A1 SB"},"Audi A1 SB - Benzin",{"$f":"'topprodukte-benzin-diesel'!O2","v":70},{"$f":"'topprodukte-benzin-diesel'!J2","v":"Benzin"},{"$f":"IF(E9=\"Benzin\",$O$3*G9,$O$4*G9)","v":47.823999999999991},{"$f":"'topprodukte-benzin-diesel'!I2","v":5.6},{"$f":"'topprodukte-benzin-diesel'!K2","v":126},{"$f":"'topprodukte-benzin-diesel'!F2","v":21780},{"$f":"IF(H9>$U$4,IF(I9*0.02>960,960,I9*0.02),IF(H9>0,IF(I9*0.015>720,720,I9*0.015),0))","v":326.7},{"$f":"J9*Eingabe!$C$48","v":98.009999999999991},"topprodukte.at",null,"Hu Gasöl (Diesel) =",41820,"kJ/kg",null,"Diesel",null,null,null,null,null,"bis März 2020",118,"(NEFZ-Wert)"]
[{"$f":"'topprodukte-benzin-diesel'!A3","v":"Audi"},{"$f":"'topprodukte-benzin-diesel'!B3","v":"A3 SB"},"Audi A3 SB - Benzin",{"$f":"'topprodukte-benzin-diesel'!O3","v":85},{"$f":"'topprodukte-benzin-diesel'!J3","v":"Benzin"},37.576000000000001,{"$f":"'topprodukte-benzin-diesel'!I3","v":4.4000000000000004},{"$f":"'topprodukte-benzin-diesel'!K3","v":114},{"$f":"'topprodukte-benzin-diesel'!F3","v":29600},{"$f":"IF(H10>$U$4,IF(I10*0.02>960,960,I10*0.02),IF(H10>0,IF(I10*0.015>720,720,I10*0.015),0))","v":444},{"$f":"J10*Eingabe!$C$48","v":133.19999999999999},"topprodukte.at",null,null,null,null,null,null,null,null,null,null,null,"ab April 2020",141,"(WLTP-Wert)"]
[{"$f":"'topprodukte-benzin-diesel'!A4","v":"Audi"},{"$f":"'topprodukte-benzin-diesel'!B4","v":"A4 Limousine"},"Audi A4 Limousine - Benzin",{"$f":"'topprodukte-benzin-diesel'!O4","v":90},{"$f":"'topprodukte-benzin-diesel'!J4","v":"Benzin"},41.845999999999997,{"$f":"'topprodukte-benzin-diesel'!I4","v":4.9000000000000004},{"$f":"'topprodukte-benzin-diesel'!K4","v":128},{"$f":"'topprodukte-benzin-diesel'!F4","v":36970},554.54999999999995,{"$f":"J11*Eingabe!$C$48","v":166.36499999999998},"topprodukte.at",null,"Quelle: Recknagel, Sprenger, Schramek; Taschenbuch für Heizung + Klimatechnik; 2001; Seite 209",null,null,null,null,null,null,null,null,null,2021,138,"(WLTP-Wert)"]
[{"$f":"'topprodukte-benzin-diesel'!A5","v":"Audi"},{"$f":"'topprodukte-benzin-diesel'!B5","v":"A3 SB"},"Audi A3 SB - Diesel",{"$f":"'topprodukte-benzin-diesel'!O5","v":85},{"$f":"'topprodukte-benzin-diesel'!J5","v":"Diesel"},44.468600000000009,{"$f":"'topprodukte-benzin-diesel'!I5","v":4.4000000000000004},{"$f":"'topprodukte-benzin-diesel'!K5","v":114},{"$f":"'topprodukte-benzin-diesel'!F5","v":29600},444,{"$f":"J12*Eingabe!$C$48","v":133.19999999999999},"topprodukte.at",null,null,null,null,null,null,null,null,null,null,null,2022,135,"(WLTP-Wert)"]
[{"$f":"'topprodukte-benzin-diesel'!A6","v":"Audi"},{"$f":"'topprodukte-benzin-diesel'!B6","v":"A4 Limousine"},"Audi A4 Limousine - Diesel",{"$f":"'topprodukte-benzin-diesel'!O6","v":90},{"$f":"'topprodukte-benzin-diesel'!J6","v":"Diesel"},49.521850000000008,{"$f":"'topprodukte-benzin-diesel'!I6","v":4.9000000000000004},{"$f":"'topprodukte-benzin-diesel'!K6","v":128},{"$f":"'topprodukte-benzin-diesel'!F6","v":36970},554.54999999999995,{"$f":"J13*Eingabe!$C$48","v":166.36499999999998},"topprodukte.at",null,null,null,null,null,null,null,null,null,null,null,2023,132,"(WLTP-Wert)"]
[{"$f":"'topprodukte-benzin-diesel'!A7","v":"BMW"},{"$f":"'topprodukte-benzin-diesel'!B7","v":"2er Gran Tourer"},"BMW 2er Gran Tourer - Benzin",{"$f":"'topprodukte-benzin-diesel'!O7","v":80},{"$f":"'topprodukte-benzin-diesel'!J7","v":"Benzin"},{"$f":"IF(E14=\"Benzin\",$O$3*G14,$O$4*G14)","v":54.655999999999999},{"$f":"'topprodukte-benzin-diesel'!I7","v":6.4},{"$f":"'topprodukte-benzin-diesel'!K7","v":146},{"$f":"'topprodukte-benzin-diesel'!F7","v":31350},{"$f":"IF(H14>$U$4,IF(I14*0.02>960,960,I14*0.02),IF(H14>0,IF(I14*0.015>720,720,I14*0.015),0))","v":627},{"$f":"J14*Eingabe!$C$48","v":188.1},"topprodukte.at",null,null,null,null,null,null,null,null,null,null,null,2024,129,"(WLTP-Wert)"]
[{"$f":"'topprodukte-benzin-diesel'!A8","v":"BMW"},{"$f":"'topprodukte-benzin-diesel'!B8","v":"1er Limousine"},"BMW 1er Limousine - Benzin",{"$f":"'topprodukte-benzin-diesel'!O8","v":85},{"$f":"'topprodukte-benzin-diesel'!J8","v":"Benzin"},38.429999999999993,{"$f":"'topprodukte-benzin-diesel'!I8","v":4.5},{"$f":"'topprodukte-benzin-diesel'!K8","v":118},{"$f":"'topprodukte-benzin-diesel'!F8","v":31160},467.4,{"$f":"J15*Eingabe!$C$48","v":140.22},"topprodukte.at",null,null,null,null,null,null,null,null,null,null,null,2025,126,"(WLTP-Wert)"]
[{"$f":"'topprodukte-benzin-diesel'!A9","v":"BMW"},{"$f":"'topprodukte-benzin-diesel'!B9","v":"3er Limousine"},"BMW 3er Limousine - Benzin",{"$f":"'topprodukte-benzin-diesel'!O9","v":110},{"$f":"'topprodukte-benzin-diesel'!J9","v":"Benzin"},40.991999999999997,{"$f":"'topprodukte-benzin-diesel'!I9","v":4.8},{"$f":"'topprodukte-benzin-diesel'!K9","v":125},{"$f":"'topprodukte-benzin-diesel'!F9","v":38950},584.25,{"$f":"J16*Eingabe!$C$48","v":175.27500000000001},"topprodukte.at"]
[{"$f":"'topprodukte-benzin-diesel'!A10","v":"BMW"},{"$f":"'topprodukte-benzin-diesel'!B10","v":"2er Active Tourer"},"BMW 2er Active Tourer - Benzin",{"$f":"'topprodukte-benzin-diesel'!O10","v":85},{"$f":"'topprodukte-benzin-diesel'!J10","v":"Benzin"},40.137999999999998,{"$f":"'topprodukte-benzin-diesel'!I10","v":4.7},{"$f":"'topprodukte-benzin-diesel'!K10","v":123},{"$f":"'topprodukte-benzin-diesel'!F10","v":32050},480.75,{"$f":"J17*Eingabe!$C$48","v":144.22499999999999},"topprodukte.at"]
[{"$f":"'topprodukte-benzin-diesel'!A11","v":"BMW"},{"$f":"'topprodukte-benzin-diesel'!B11","v":"2er Gran Tourer"},"BMW 2er Gran Tourer - Benzin",{"$f":"'topprodukte-benzin-diesel'!O11","v":85},{"$f":"'topprodukte-benzin-diesel'!J11","v":"Benzin"},41.845999999999997,{"$f":"'topprodukte-benzin-diesel'!I11","v":4.9000000000000004},{"$f":"'topprodukte-benzin-diesel'!K11","v":128},{"$f":"'topprodukte-benzin-diesel'!F11","v":33600},504,{"$f":"J18*Eingabe!$C$48","v":151.19999999999999},"topprodukte.at"]
[{"$f":"'topprodukte-benzin-diesel'!A12","v":"BMW"},{"$f":"'topprodukte-benzin-diesel'!B12","v":"1er Limousine"},"BMW 1er Limousine - Diesel",{"$f":"'topprodukte-benzin-diesel'!O12","v":85},{"$f":"'topprodukte-benzin-diesel'!J12","v":"Diesel"},45.47925,{"$f":"'topprodukte-benzin-diesel'!I12","v":4.5},{"$f":"'topprodukte-benzin-diesel'!K12","v":118},{"$f":"'topprodukte-benzin-diesel'!F12","v":31160},467.4,{"$f":"J19*Eingabe!$C$48","v":140.22},"topprodukte.at"]
[{"$f":"'topprodukte-benzin-diesel'!A13","v":"BMW"},{"$f":"'topprodukte-benzin-diesel'!B13","v":"3er Limousine"},"BMW 3er Limousine - Diesel",{"$f":"'topprodukte-benzin-diesel'!O13","v":110},{"$f":"'topprodukte-benzin-diesel'!J13","v":"Diesel"},48.511200000000002,{"$f":"'topprodukte-benzin-diesel'!I13","v":4.8},{"$f":"'topprodukte-benzin-diesel'!K13","v":125},{"$f":"'topprodukte-benzin-diesel'!F13","v":38950},584.25,{"$f":"J20*Eingabe!$C$48","v":175.27500000000001},"topprodukte.at"]
[{"$f":"'topprodukte-benzin-diesel'!A14","v":"BMW"},{"$f":"'topprodukte-benzin-diesel'!B14","v":"2er Active Tourer"},"BMW 2er Active Tourer - Diesel",{"$f":"'topprodukte-benzin-diesel'!O14","v":85},{"$f":"'topprodukte-benzin-diesel'!J14","v":"Diesel"},47.500550000000004,{"$f":"'topprodukte-benzin-diesel'!I14","v":4.7},{"$f":"'topprodukte-benzin-diesel'!K14","v":123},{"$f":"'topprodukte-benzin-diesel'!F14","v":32050},480.75,{"$f":"J21*Eingabe!$C$48","v":144.22499999999999},"topprodukte.at"]
[{"$f":"'topprodukte-benzin-diesel'!A15","v":"Citroen"},{"$f":"'topprodukte-benzin-diesel'!B15","v":"C1 "},"Citroen C1  - Benzin",{"$f":"'topprodukte-benzin-diesel'!O15","v":53},{"$f":"'topprodukte-benzin-diesel'!J15","v":"Benzin"},40.991999999999997,{"$f":"'topprodukte-benzin-diesel'!I15","v":4.8},{"$f":"'topprodukte-benzin-diesel'!K15","v":110},{"$f":"'topprodukte-benzin-diesel'!F15","v":11490},172.35,{"$f":"J22*Eingabe!$C$48","v":51.704999999999998},"topprodukte.at"]
[{"$f":"'topprodukte-benzin-diesel'!A16","v":"Citroen"},{"$f":"'topprodukte-benzin-diesel'!B16","v":"C3"},"Citroen C3 - Benzin",{"$f":"'topprodukte-benzin-diesel'!O16","v":61},{"$f":"'topprodukte-benzin-diesel'!J16","v":"Benzin"},48.677999999999997,{"$f":"'topprodukte-benzin-diesel'!I16","v":5.7},{"$f":"'topprodukte-benzin-diesel'!K16","v":127},{"$f":"'topprodukte-benzin-diesel'!F16","v":13390},200.85,{"$f":"J23*Eingabe!$C$48","v":60.254999999999995},"topprodukte.at"]
[{"$f":"'topprodukte-benzin-diesel'!A17","v":"Citroen"},{"$f":"'topprodukte-benzin-diesel'!B17","v":"C3 Aircross"},"Citroen C3 Aircross - Benzin",{"$f":"'topprodukte-benzin-diesel'!O17","v":81},{"$f":"'topprodukte-benzin-diesel'!J17","v":"Benzin"},52.947999999999993,{"$f":"'topprodukte-benzin-diesel'!I17","v":6.2},{"$f":"'topprodukte-benzin-diesel'!K17","v":141},{"$f":"'topprodukte-benzin-diesel'!F17","v":20320},406.40000000000003,{"$f":"J24*Eingabe!$C$48","v":121.92},"topprodukte.at"]
[{"$f":"'topprodukte-benzin-diesel'!A18","v":"Citroen"},{"$f":"'topprodukte-benzin-diesel'!B18","v":"Grand C4 Spacetourer"},"Citroen Grand C4 Spacetourer - Benzin",{"$f":"'topprodukte-benzin-diesel'!O18","v":96},{"$f":"'topprodukte-benzin-diesel'!J18","v":"Benzin"},53.801999999999992,{"$f":"'topprodukte-benzin-diesel'!I18","v":6.3},{"$f":"'topprodukte-benzin-diesel'!K18","v":143},{"$f":"'topprodukte-benzin-diesel'!F18","v":28550},571,{"$f":"J25*Eingabe!$C$48","v":171.29999999999998},"topprodukte.at"]
[{"$f":"'topprodukte-benzin-diesel'!A19","v":"Citroen"},{"$f":"'topprodukte-benzin-diesel'!B19","v":"C5 Aircross"},"Citroen C5 Aircross - Benzin",{"$f":"'topprodukte-benzin-diesel'!O19","v":96},{"$f":"'topprodukte-benzin-diesel'!J19","v":"Benzin"},56.36399999999999,{"$f":"'topprodukte-benzin-diesel'!I19","v":6.6},{"$f":"'topprodukte-benzin-diesel'!K19","v":149},{"$f":"'topprodukte-benzin-diesel'!F19","v":26690},533.79999999999995,{"$f":"J26*Eingabe!$C$48","v":160.13999999999999},"topprodukte.at"]
[{"$f":"'topprodukte-benzin-diesel'!A20","v":"Citroen"},{"$f":"'topprodukte-benzin-diesel'!B20","v":"C4 Cactus"},"Citroen C4 Cactus - Benzin",{"$f":"'topprodukte-benzin-diesel'!O20","v":75},{"$f":"'topprodukte-benzin-diesel'!J20","v":"Benzin"},38.429999999999993,{"$f":"'topprodukte-benzin-diesel'!I20","v":4.5},{"$f":"'topprodukte-benzin-diesel'!K20","v":118},{"$f":"'topprodukte-benzin-diesel'!F20","v":20275},304.125,{"$f":"J27*Eingabe!$C$48","v":91.237499999999997},"topprodukte.at"]
[{"$f":"'topprodukte-benzin-diesel'!A21","v":"Citroen"},{"$f":"'topprodukte-benzin-diesel'!B21","v":"C3 Aircross"},"Citroen C3 Aircross - Benzin",{"$f":"'topprodukte-benzin-diesel'!O21","v":75},{"$f":"'topprodukte-benzin-diesel'!J21","v":"Benzin"},40.137999999999998,{"$f":"'topprodukte-benzin-diesel'!I21","v":4.7},{"$f":"'topprodukte-benzin-diesel'!K21","v":123},{"$f":"'topprodukte-benzin-diesel'!F21","v":20790},311.84999999999997,{"$f":"J28*Eingabe!$C$48","v":93.554999999999993},"topprodukte.at"]
[{"$f":"'topprodukte-benzin-diesel'!A22","v":"Citroen"},{"$f":"'topprodukte-benzin-diesel'!B22","v":"C4 Spacetourer"},"Citroen C4 Spacetourer - Benzin",{"$f":"'topprodukte-benzin-diesel'!O22","v":96},{"$f":"'topprodukte-benzin-diesel'!J22","v":"Benzin"},42.699999999999996,{"$f":"'topprodukte-benzin-diesel'!I22","v":5},{"$f":"'topprodukte-benzin-diesel'!K22","v":130},{"$f":"'topprodukte-benzin-diesel'!F22","v":28400},426,{"$f":"J29*Eingabe!$C$48","v":127.8},"topprodukte.at"]
[{"$f":"'topprodukte-benzin-diesel'!A23","v":"Citroen"},{"$f":"'topprodukte-benzin-diesel'!B23","v":"C5 Aircross"},"Citroen C5 Aircross - Benzin",{"$f":"'topprodukte-benzin-diesel'!O23","v":96},{"$f":"'topprodukte-benzin-diesel'!J23","v":"Benzin"},44.407999999999994,{"$f":"'topprodukte-benzin-diesel'!I23","v":5.2},{"$f":"'topprodukte-benzin-diesel'!K23","v":138},{"$f":"'topprodukte-benzin-diesel'!F23","v":29390},440.84999999999997,{"$f":"J30*Eingabe!$C$48","v":132.255},"topprodukte.at"]
[{"$f":"'topprodukte-benzin-diesel'!A24","v":"Citroen"},{"$f":"'topprodukte-benzin-diesel'!B24","v":"C3"},"Citroen C3 - Diesel",{"$f":"'topprodukte-benzin-diesel'!O24","v":75},{"$f":"'topprodukte-benzin-diesel'!J24","v":"Diesel"},45.47925,{"$f":"'topprodukte-benzin-diesel'!I24","v":4.5},{"$f":"'topprodukte-benzin-diesel'!K24","v":117},{"$f":"'topprodukte-benzin-diesel'!F24","v":18290},274.34999999999997,{"$f":"J31*Eingabe!$C$48","v":82.304999999999993},"topprodukte.at"]
[{"$f":"'topprodukte-benzin-diesel'!A25","v":"Citroen"},{"$f":"'topprodukte-benzin-diesel'!B25","v":"C4 Cactus"},"Citroen C4 Cactus - Diesel",{"$f":"'topprodukte-benzin-diesel'!O25","v":75},{"$f":"'topprodukte-benzin-diesel'!J25","v":"Diesel"},45.47925,{"$f":"'topprodukte-benzin-diesel'!I25","v":4.5},{"$f":"'topprodukte-benzin-diesel'!K25","v":118},{"$f":"'topprodukte-benzin-diesel'!F25","v":20275},304.125,{"$f":"J32*Eingabe!$C$48","v":91.237499999999997},"topprodukte.at"]
[{"$f":"'topprodukte-benzin-diesel'!A26","v":"Citroen"},{"$f":"'topprodukte-benzin-diesel'!B26","v":"C3 Aircross"},"Citroen C3 Aircross - Diesel",{"$f":"'topprodukte-benzin-diesel'!O26","v":75},{"$f":"'topprodukte-benzin-diesel'!J26","v":"Diesel"},47.500550000000004,{"$f":"'topprodukte-benzin-diesel'!I26","v":4.7},{"$f":"'topprodukte-benzin-diesel'!K26","v":123},{"$f":"'topprodukte-benzin-diesel'!F26","v":20790},311.84999999999997,{"$f":"J33*Eingabe!$C$48","v":93.554999999999993},"topprodukte.at"]
[{"$f":"'topprodukte-benzin-diesel'!A27","v":"Dacia"},{"$f":"'topprodukte-benzin-diesel'!B27","v":"Logan MCV"},"Dacia Logan MCV - Benzin",{"$f":"'topprodukte-benzin-diesel'!O27","v":54},{"$f":"'topprodukte-benzin-diesel'!J27","v":"Benzin"},48.677999999999997,{"$f":"'topprodukte-benzin-diesel'!I27","v":5.7},{"$f":"'topprodukte-benzin-diesel'!K27","v":129},{"$f":"'topprodukte-benzin-diesel'!F27","v":8590},128.85,{"$f":"J34*Eingabe!$C$48","v":38.654999999999994},"topprodukte.at"]
[{"$f":"'topprodukte-benzin-diesel'!A28","v":"Dacia"},{"$f":"'topprodukte-benzin-diesel'!B28","v":"Sandero"},"Dacia Sandero - Benzin",{"$f":"'topprodukte-benzin-diesel'!O28","v":54},{"$f":"'topprodukte-benzin-diesel'!J28","v":"Benzin"},48.677999999999997,{"$f":"'topprodukte-benzin-diesel'!I28","v":5.7},{"$f":"'topprodukte-benzin-diesel'!K28","v":129},{"$f":"'topprodukte-benzin-diesel'!F28","v":7790},116.85,{"$f":"J35*Eingabe!$C$48","v":35.055},"topprodukte.at"]
[{"$f":"'topprodukte-benzin-diesel'!A29","v":"Dacia"},{"$f":"'topprodukte-benzin-diesel'!B29","v":"Duster"},"Dacia Duster - Benzin",{"$f":"'topprodukte-benzin-diesel'!O29","v":74},{"$f":"'topprodukte-benzin-diesel'!J29","v":"Benzin"},{"$f":"IF(E36=\"Benzin\",$O$3*G36,$O$4*G36)","v":52.093999999999994},{"$f":"'topprodukte-benzin-diesel'!I29","v":6.1},{"$f":"'topprodukte-benzin-diesel'!K29","v":138},{"$f":"'topprodukte-benzin-diesel'!F29","v":12990},194.85,{"$f":"J36*Eingabe!$C$48","v":58.454999999999998},"topprodukte.at"]
[{"$f":"'topprodukte-benzin-diesel'!A30","v":"Dacia"},{"$f":"'topprodukte-benzin-diesel'!B30","v":"Sandero"},"Dacia Sandero - Benzin",{"$f":"'topprodukte-benzin-diesel'!O30","v":55},{"$f":"'topprodukte-benzin-diesel'!J30","v":"Benzin"},37.576000000000001,{"$f":"'topprodukte-benzin-diesel'!I30","v":4.4000000000000004},{"$f":"'topprodukte-benzin-diesel'!K30","v":116},{"$f":"'topprodukte-benzin-diesel'!F30","v":11340},{"$f":"IF(H37>$U$4,IF(I37*0.02>960,960,I37*0.02),IF(H37>0,IF(I37*0.015>720,720,I37*0.015),0))","v":170.1},{"$f":"J37*Eingabe!$C$48","v":51.029999999999994},"topprodukte.at"]
[{"$f":"'topprodukte-benzin-diesel'!A31","v":"Dacia"},{"$f":"'topprodukte-benzin-diesel'!B31","v":"Lodgy"},"Dacia Lodgy - Benzin",{"$f":"'topprodukte-benzin-diesel'!O31","v":70},{"$f":"'topprodukte-benzin-diesel'!J31","v":"Benzin"},40.991999999999997,{"$f":"'topprodukte-benzin-diesel'!I31","v":4.8},{"$f":"'topprodukte-benzin-diesel'!K31","v":126},{"$f":"'topprodukte-benzin-diesel'!F31","v":15350},230.25,{"$f":"J38*Eingabe!$C$48","v":69.075000000000003},"topprodukte.at"]
[{"$f":"'topprodukte-benzin-diesel'!A32","v":"Dacia"},{"$f":"'topprodukte-benzin-diesel'!B32","v":"Duster"},"Dacia Duster - Benzin",{"$f":"'topprodukte-benzin-diesel'!O32","v":70},{"$f":"'topprodukte-benzin-diesel'!J32","v":"Benzin"},41.845999999999997,{"$f":"'topprodukte-benzin-diesel'!I32","v":4.9000000000000004},{"$f":"'topprodukte-benzin-diesel'!K32","v":128},{"$f":"'topprodukte-benzin-diesel'!F32","v":15490},232.35,{"$f":"J39*Eingabe!$C$48","v":69.704999999999998},"topprodukte.at"]
[{"$f":"'topprodukte-benzin-diesel'!A33","v":"Dacia"},{"$f":"'topprodukte-benzin-diesel'!B33","v":"Dokker"},"Dacia Dokker - Benzin",{"$f":"'topprodukte-benzin-diesel'!O33","v":70},{"$f":"'topprodukte-benzin-diesel'!J33","v":"Benzin"},42.699999999999996,{"$f":"'topprodukte-benzin-diesel'!I33","v":5},{"$f":"'topprodukte-benzin-diesel'!K33","v":132},{"$f":"'topprodukte-benzin-diesel'!F33","v":14250},213.75,{"$f":"J40*Eingabe!$C$48","v":64.125},"topprodukte.at"]
[{"$f":"'topprodukte-benzin-diesel'!A34","v":"Dacia"},{"$f":"'topprodukte-benzin-diesel'!B34","v":"Sandero"},"Dacia Sandero - Diesel",{"$f":"'topprodukte-benzin-diesel'!O34","v":55},{"$f":"'topprodukte-benzin-diesel'!J34","v":"Diesel"},44.468600000000009,{"$f":"'topprodukte-benzin-diesel'!I34","v":4.4000000000000004},{"$f":"'topprodukte-benzin-diesel'!K34","v":116},{"$f":"'topprodukte-benzin-diesel'!F34","v":11340},170.1,{"$f":"J41*Eingabe!$C$48","v":51.029999999999994},"topprodukte.at"]
[{"$f":"'topprodukte-benzin-diesel'!A35","v":"DS Automobiles"},{"$f":"'topprodukte-benzin-diesel'!B35","v":"DS 7"},"DS Automobiles DS 7 - Benzin",{"$f":"'topprodukte-benzin-diesel'!O35","v":96},{"$f":"'topprodukte-benzin-diesel'!J35","v":"Benzin"},44.407999999999994,{"$f":"'topprodukte-benzin-diesel'!I35","v":5.2},{"$f":"'topprodukte-benzin-diesel'!K35","v":136},{"$f":"'topprodukte-benzin-diesel'!F35","v":41290},619.35,{"$f":"J42*Eingabe!$C$48","v":185.80500000000001},"topprodukte.at"]
[{"$f":"'topprodukte-benzin-diesel'!A36","v":"Fiat"},{"$f":"'topprodukte-benzin-diesel'!B36","v":500},"Fiat 500 - Benzin",{"$f":"'topprodukte-benzin-diesel'!O36","v":51},{"$f":"'topprodukte-benzin-diesel'!J36","v":"Benzin"},46.97,{"$f":"'topprodukte-benzin-diesel'!I36","v":5.5},{"$f":"'topprodukte-benzin-diesel'!K36","v":135},{"$f":"'topprodukte-benzin-diesel'!F36","v":18170},272.55,{"$f":"J43*Eingabe!$C$48","v":81.765000000000001},"topprodukte.at"]
[{"$f":"'topprodukte-benzin-diesel'!A37","v":"Fiat"},{"$f":"'topprodukte-benzin-diesel'!B37","v":"Panda"},"Fiat Panda - Benzin",{"$f":"'topprodukte-benzin-diesel'!O37","v":51},{"$f":"'topprodukte-benzin-diesel'!J37","v":"Benzin"},48.677999999999997,{"$f":"'topprodukte-benzin-diesel'!I37","v":5.7},{"$f":"'topprodukte-benzin-diesel'!K37","v":133},{"$f":"'topprodukte-benzin-diesel'!F37","v":12100},181.5,{"$f":"J44*Eingabe!$C$48","v":54.449999999999996},"topprodukte.at"]
[{"$f":"'topprodukte-benzin-diesel'!A38","v":"Fiat"},{"$f":"'topprodukte-benzin-diesel'!B38","v":"Tipo Kombi"},"Fiat Tipo Kombi - Benzin",{"$f":"'topprodukte-benzin-diesel'!O38","v":70},{"$f":"'topprodukte-benzin-diesel'!J38","v":"Benzin"},39.283999999999992,{"$f":"'topprodukte-benzin-diesel'!I38","v":4.5999999999999996},{"$f":"'topprodukte-benzin-diesel'!K38","v":120},{"$f":"'topprodukte-benzin-diesel'!F38","v":21170},317.55,{"$f":"J45*Eingabe!$C$48","v":95.265000000000001},"topprodukte.at"]
[{"$f":"'topprodukte-benzin-diesel'!A39","v":"Fiat"},{"$f":"'topprodukte-benzin-diesel'!B39","v":"500X Urban"},"Fiat 500X Urban - Benzin",{"$f":"'topprodukte-benzin-diesel'!O39","v":70},{"$f":"'topprodukte-benzin-diesel'!J39","v":"Benzin"},35.4,{"$f":"'topprodukte-benzin-diesel'!I39","v":4.8},{"$f":"'topprodukte-benzin-diesel'!K39","v":126},{"$f":"'topprodukte-benzin-diesel'!F39","v":22100},331.5,{"$f":"J46*Eingabe!$C$48","v":99.45},"topprodukte.at"]
[{"$f":"'topprodukte-benzin-diesel'!A40","v":"Fiat"},{"$f":"'topprodukte-benzin-diesel'!B40","v":"Tipo Kombi"},"Fiat Tipo Kombi - Diesel",{"$f":"'topprodukte-benzin-diesel'!O40","v":70},{"$f":"'topprodukte-benzin-diesel'!J40","v":"Diesel"},{"$f":"IF(E47=\"Benzin\",$O$3*G47,$O$4*G47)","v":46.489899999999999},{"$f":"'topprodukte-benzin-diesel'!I40","v":4.5999999999999996},{"$f":"'topprodukte-benzin-diesel'!K40","v":120},{"$f":"'topprodukte-benzin-diesel'!F40","v":21170},317.55,{"$f":"J47*Eingabe!$C$48","v":95.265000000000001},"topprodukte.at"]
[{"$f":"'topprodukte-benzin-diesel'!A41","v":"Fiat"},{"$f":"'topprodukte-benzin-diesel'!B41","v":"500X Urban"},"Fiat 500X Urban - Diesel",{"$f":"'topprodukte-benzin-diesel'!O41","v":70},{"$f":"'topprodukte-benzin-diesel'!J41","v":"Diesel"},48.511200000000002,{"$f":"'topprodukte-benzin-diesel'!I41","v":4.8},{"$f":"'topprodukte-benzin-diesel'!K41","v":126},{"$f":"'topprodukte-benzin-diesel'!F41","v":22100},331.5,{"$f":"J48*Eingabe!$C$48","v":99.45},"topprodukte.at"]
[{"$f":"'topprodukte-benzin-diesel'!A42","v":"Ford"},{"$f":"'topprodukte-benzin-diesel'!B42","v":"Fiesta Coupe"},"Ford Fiesta Coupe - Benzin",{"$f":"'topprodukte-benzin-diesel'!O42","v":70},{"$f":"'topprodukte-benzin-diesel'!J42","v":"Benzin"},43.553999999999995,{"$f":"'topprodukte-benzin-diesel'!I42","v":5.0999999999999996},{"$f":"'topprodukte-benzin-diesel'!K42","v":115},{"$f":"'topprodukte-benzin-diesel'!F42","v":15300},229.5,{"$f":"J49*Eingabe!$C$48","v":68.849999999999994},"topprodukte.at"]
[{"$f":"'topprodukte-benzin-diesel'!A43","v":"Ford"},{"$f":"'topprodukte-benzin-diesel'!B43","v":"Focus"},"Ford Focus - Benzin",{"$f":"'topprodukte-benzin-diesel'!O43","v":74},{"$f":"'topprodukte-benzin-diesel'!J43","v":"Benzin"},45.261999999999993,{"$f":"'topprodukte-benzin-diesel'!I43","v":5.3},{"$f":"'topprodukte-benzin-diesel'!K43","v":119},{"$f":"'topprodukte-benzin-diesel'!F43","v":22100},331.5,{"$f":"J50*Eingabe!$C$48","v":99.45},"topprodukte.at"]
[{"$f":"'topprodukte-benzin-diesel'!A44","v":"Ford"},{"$f":"'topprodukte-benzin-diesel'!B44","v":"Focus Turnier"},"Ford Focus Turnier - Benzin",{"$f":"'topprodukte-benzin-diesel'!O44","v":74},{"$f":"'topprodukte-benzin-diesel'!J44","v":"Benzin"},45.261999999999993,{"$f":"'topprodukte-benzin-diesel'!I44","v":5.3},{"$f":"'topprodukte-benzin-diesel'!K44","v":119},{"$f":"'topprodukte-benzin-diesel'!F44","v":23600},354,{"$f":"J51*Eingabe!$C$48","v":106.2},"topprodukte.at"]
[{"$f":"'topprodukte-benzin-diesel'!A45","v":"Ford"},{"$f":"'topprodukte-benzin-diesel'!B45","v":"EcoSport"},"Ford EcoSport - Benzin",{"$f":"'topprodukte-benzin-diesel'!O45","v":74},{"$f":"'topprodukte-benzin-diesel'!J45","v":"Benzin"},50.385999999999996,{"$f":"'topprodukte-benzin-diesel'!I45","v":5.9},{"$f":"'topprodukte-benzin-diesel'!K45","v":134},{"$f":"'topprodukte-benzin-diesel'!F45","v":20300},304.5,{"$f":"J52*Eingabe!$C$48","v":91.35},"topprodukte.at"]
[{"$f":"'topprodukte-benzin-diesel'!A46","v":"Ford"},{"$f":"'topprodukte-benzin-diesel'!B46","v":"Fiesta"},"Ford Fiesta - Benzin",{"$f":"'topprodukte-benzin-diesel'!O46","v":63},{"$f":"'topprodukte-benzin-diesel'!J46","v":"Benzin"},35.867999999999995,{"$f":"'topprodukte-benzin-diesel'!I46","v":4.2},{"$f":"'topprodukte-benzin-diesel'!K46","v":111},{"$f":"'topprodukte-benzin-diesel'!F46","v":16650},249.75,{"$f":"J53*Eingabe!$C$48","v":74.924999999999997},"topprodukte.at"]
[{"$f":"'topprodukte-benzin-diesel'!A47","v":"Ford"},{"$f":"'topprodukte-benzin-diesel'!B47","v":"Focus"},"Ford Focus - Benzin",{"$f":"'topprodukte-benzin-diesel'!O47","v":70},{"$f":"'topprodukte-benzin-diesel'!J47","v":"Benzin"},38.429999999999993,{"$f":"'topprodukte-benzin-diesel'!I47","v":4.5},{"$f":"'topprodukte-benzin-diesel'!K47","v":117},{"$f":"'topprodukte-benzin-diesel'!F47","v":23650},354.75,{"$f":"J54*Eingabe!$C$48","v":106.425},"topprodukte.at"]
[{"$f":"'topprodukte-benzin-diesel'!A48","v":"Ford"},{"$f":"'topprodukte-benzin-diesel'!B48","v":"Puma"},"Ford Puma - Benzin",{"$f":"'topprodukte-benzin-diesel'!O48","v":88},{"$f":"'topprodukte-benzin-diesel'!J48","v":"Benzin"},38.429999999999993,{"$f":"'topprodukte-benzin-diesel'!I48","v":4.5},{"$f":"'topprodukte-benzin-diesel'!K48","v":118},{"$f":"'topprodukte-benzin-diesel'!F48","v":25890},388.34999999999997,{"$f":"J55*Eingabe!$C$48","v":116.50499999999998},"topprodukte.at"]
[{"$f":"'topprodukte-benzin-diesel'!A49","v":"Ford"},{"$f":"'topprodukte-benzin-diesel'!B49","v":"Focus Turnier"},"Ford Focus Turnier - Benzin",{"$f":"'topprodukte-benzin-diesel'!O49","v":70},{"$f":"'topprodukte-benzin-diesel'!J49","v":"Benzin"},38.429999999999993,{"$f":"'topprodukte-benzin-diesel'!I49","v":4.5},{"$f":"'topprodukte-benzin-diesel'!K49","v":119},{"$f":"'topprodukte-benzin-diesel'!F49","v":25150},377.25,{"$f":"J56*Eingabe!$C$48","v":113.175},"topprodukte.at"]
[{"$f":"'topprodukte-benzin-diesel'!A50","v":"Ford"},{"$f":"'topprodukte-benzin-diesel'!B50","v":"Mondeo"},"Ford Mondeo - Benzin",{"$f":"'topprodukte-benzin-diesel'!O50","v":88},{"$f":"'topprodukte-benzin-diesel'!J50","v":"Benzin"},41.845999999999997,{"$f":"'topprodukte-benzin-diesel'!I50","v":4.9000000000000004},{"$f":"'topprodukte-benzin-diesel'!K50","v":128},{"$f":"'topprodukte-benzin-diesel'!F50","v":34100},511.5,{"$f":"J57*Eingabe!$C$48","v":153.44999999999999},"topprodukte.at"]
[{"$f":"'topprodukte-benzin-diesel'!A51","v":"Ford"},{"$f":"'topprodukte-benzin-diesel'!B51","v":"EcoSport"},"Ford EcoSport - Benzin",{"$f":"'topprodukte-benzin-diesel'!O51","v":74},{"$f":"'topprodukte-benzin-diesel'!J51","v":"Benzin"},41.845999999999997,{"$f":"'topprodukte-benzin-diesel'!I51","v":4.9000000000000004},{"$f":"'topprodukte-benzin-diesel'!K51","v":129},{"$f":"'topprodukte-benzin-diesel'!F51","v":23700},355.5,{"$f":"J58*Eingabe!$C$48","v":106.64999999999999},"topprodukte.at"]
[{"$f":"'topprodukte-benzin-diesel'!A52","v":"Ford"},{"$f":"'topprodukte-benzin-diesel'!B52","v":"Tourneo Courier"},"Ford Tourneo Courier - Benzin",{"$f":"'topprodukte-benzin-diesel'!O52","v":55},{"$f":"'topprodukte-benzin-diesel'!J52","v":"Benzin"},46.116,{"$f":"'topprodukte-benzin-diesel'!I52","v":5.4},{"$f":"'topprodukte-benzin-diesel'!K52","v":141},{"$f":"'topprodukte-benzin-diesel'!F52","v":18142},362.84000000000003,{"$f":"J59*Eingabe!$C$48","v":108.852},"topprodukte.at"]
[{"$f":"'topprodukte-benzin-diesel'!A53","v":"Ford"},{"$f":"'topprodukte-benzin-diesel'!B53","v":"Fiesta"},"Ford Fiesta - Diesel",{"$f":"'topprodukte-benzin-diesel'!O53","v":63},{"$f":"'topprodukte-benzin-diesel'!J53","v":"Diesel"},42.447300000000006,{"$f":"'topprodukte-benzin-diesel'!I53","v":4.2},{"$f":"'topprodukte-benzin-diesel'!K53","v":111},{"$f":"'topprodukte-benzin-diesel'!F53","v":16650},249.75,{"$f":"J60*Eingabe!$C$48","v":74.924999999999997},"topprodukte.at"]
[{"$f":"'topprodukte-benzin-diesel'!A54","v":"Ford"},{"$f":"'topprodukte-benzin-diesel'!B54","v":"Focus"},"Ford Focus - Diesel",{"$f":"'topprodukte-benzin-diesel'!O54","v":70},{"$f":"'topprodukte-benzin-diesel'!J54","v":"Diesel"},45.47925,{"$f":"'topprodukte-benzin-diesel'!I54","v":4.5},{"$f":"'topprodukte-benzin-diesel'!K54","v":117},{"$f":"'topprodukte-benzin-diesel'!F54","v":23650},354.75,{"$f":"J61*Eingabe!$C$48","v":106.425},"topprodukte.at"]
[{"$f":"'topprodukte-benzin-diesel'!A55","v":"Ford"},{"$f":"'topprodukte-benzin-diesel'!B55","v":"Puma"},"Ford Puma - Diesel",{"$f":"'topprodukte-benzin-diesel'!O55","v":88},{"$f":"'topprodukte-benzin-diesel'!J55","v":"Diesel"},45.47925,{"$f":"'topprodukte-benzin-diesel'!I55","v":4.5},{"$f":"'topprodukte-benzin-diesel'!K55","v":118},{"$f":"'topprodukte-benzin-diesel'!F55","v":25890},388.34999999999997,{"$f":"J62*Eingabe!$C$48","v":116.50499999999998},"topprodukte.at"]
[{"$f":"'topprodukte-benzin-diesel'!A56","v":"Ford"},{"$f":"'topprodukte-benzin-diesel'!B56","v":"Focus Turnier"},"Ford Focus Turnier - Diesel",{"$f":"'topprodukte-benzin-diesel'!O56","v":70},{"$f":"'topprodukte-benzin-diesel'!J56","v":"Diesel"},45.47925,{"$f":"'topprodukte-benzin-diesel'!I56","v":4.5},{"$f":"'topprodukte-benzin-diesel'!K56","v":119},{"$f":"'topprodukte-benzin-diesel'!F56","v":25150},377.25,{"$f":"J63*Eingabe!$C$48","v":113.175},"topprodukte.at"]
[{"$f":"'topprodukte-benzin-diesel'!A57","v":"Ford"},{"$f":"'topprodukte-benzin-diesel'!B57","v":"Mondeo"},"Ford Mondeo - Diesel",{"$f":"'topprodukte-benzin-diesel'!O57","v":88},{"$f":"'topprodukte-benzin-diesel'!J57","v":"Diesel"},41,{"$f":"'topprodukte-benzin-diesel'!I57","v":4.9000000000000004},{"$f":"'topprodukte-benzin-diesel'!K57","v":128},{"$f":"'topprodukte-benzin-diesel'!F57","v":34100},511.5,{"$f":"J64*Eingabe!$C$48","v":153.44999999999999},"topprodukte.at"]
[{"$f":"'topprodukte-benzin-diesel'!A58","v":"Ford"},{"$f":"'topprodukte-benzin-diesel'!B58","v":"EcoSport"},"Ford EcoSport - Diesel",{"$f":"'topprodukte-benzin-diesel'!O58","v":74},{"$f":"'topprodukte-benzin-diesel'!J58","v":"Diesel"},{"$f":"IF(E65=\"Benzin\",$O$3*G65,$O$4*G65)","v":49.521850000000008},{"$f":"'topprodukte-benzin-diesel'!I58","v":4.9000000000000004},{"$f":"'topprodukte-benzin-diesel'!K58","v":129},{"$f":"'topprodukte-benzin-diesel'!F58","v":23700},355.5,{"$f":"J65*Eingabe!$C$48","v":106.64999999999999},"topprodukte.at"]
[{"$f":"'topprodukte-benzin-diesel'!A59","v":"Ford"},{"$f":"'topprodukte-benzin-diesel'!B59","v":"Tourneo Courier"},"Ford Tourneo Courier - Diesel",{"$f":"'topprodukte-benzin-diesel'!O59","v":55},{"$f":"'topprodukte-benzin-diesel'!J59","v":"Diesel"},{"$f":"IF(E66=\"Benzin\",$O$3*G66,$O$4*G66)","v":54.575100000000006},{"$f":"'topprodukte-benzin-diesel'!I59","v":5.4},{"$f":"'topprodukte-benzin-diesel'!K59","v":141},{"$f":"'topprodukte-benzin-diesel'!F59","v":18142},362.84000000000003,{"$f":"J66*Eingabe!$C$48","v":108.852},"topprodukte.at"]
[{"$f":"'topprodukte-benzin-diesel'!A60","v":"Honda"},{"$f":"'topprodukte-benzin-diesel'!B60","v":"Civic"},"Honda Civic - Benzin",{"$f":"'topprodukte-benzin-diesel'!O60","v":93},{"$f":"'topprodukte-benzin-diesel'!J60","v":"Benzin"},{"$f":"IF(E67=\"Benzin\",$O$3*G67,$O$4*G67)","v":48.677999999999997},{"$f":"'topprodukte-benzin-diesel'!I60","v":5.7},{"$f":"'topprodukte-benzin-diesel'!K60","v":128},{"$f":"'topprodukte-benzin-diesel'!F60","v":22890},343.34999999999997,{"$f":"J67*Eingabe!$C$48","v":103.00499999999998},"topprodukte.at"]
[{"$f":"'topprodukte-benzin-diesel'!A61","v":"Honda"},{"$f":"'topprodukte-benzin-diesel'!B61","v":"HR-V"},"Honda HR-V - Benzin",{"$f":"'topprodukte-benzin-diesel'!O61","v":96},{"$f":"'topprodukte-benzin-diesel'!J61","v":"Benzin"},36.299999999999997,{"$f":"'topprodukte-benzin-diesel'!I61","v":6.6},{"$f":"'topprodukte-benzin-diesel'!K61","v":148},{"$f":"'topprodukte-benzin-diesel'!F61","v":23290},465.8,{"$f":"J68*Eingabe!$C$48","v":139.74},"topprodukte.at"]
[{"$f":"'topprodukte-benzin-diesel'!A62","v":"Honda"},{"$f":"'topprodukte-benzin-diesel'!B62","v":"Civic"},"Honda Civic - Benzin",{"$f":"'topprodukte-benzin-diesel'!O62","v":88},{"$f":"'topprodukte-benzin-diesel'!J62","v":"Benzin"},{"$f":"IF(E69=\"Benzin\",$O$3*G69,$O$4*G69)","v":39.283999999999992},{"$f":"'topprodukte-benzin-diesel'!I62","v":4.5999999999999996},{"$f":"'topprodukte-benzin-diesel'!K62","v":121},{"$f":"'topprodukte-benzin-diesel'!F62","v":24390},365.84999999999997,{"$f":"J69*Eingabe!$C$48","v":109.75499999999998},"topprodukte.at"]
[{"$f":"'topprodukte-benzin-diesel'!A63","v":"Honda"},{"$f":"'topprodukte-benzin-diesel'!B63","v":"HR-V"},{"$f":"CONCATENATE(A70,\" \",B70,\" - \",E70)","v":"Honda HR-V - Benzin"},{"$f":"'topprodukte-benzin-diesel'!O63","v":88},{"$f":"'topprodukte-benzin-diesel'!J63","v":"Benzin"},42.699999999999996,{"$f":"'topprodukte-benzin-diesel'!I63","v":5},{"$f":"'topprodukte-benzin-diesel'!K63","v":132},{"$f":"'topprodukte-benzin-diesel'!F63","v":25790},386.84999999999997,{"$f":"J70*Eingabe!$C$48","v":116.05499999999998},"topprodukte.at"]
[{"$f":"'topprodukte-benzin-diesel'!A64","v":"Honda"},{"$f":"'topprodukte-benzin-diesel'!B64","v":"Civic"},"Honda Civic - Diesel",{"$f":"'topprodukte-benzin-diesel'!O64","v":88},{"$f":"'topprodukte-benzin-diesel'!J64","v":"Diesel"},46.489899999999999,{"$f":"'topprodukte-benzin-diesel'!I64","v":4.5999999999999996},{"$f":"'topprodukte-benzin-diesel'!K64","v":121},{"$f":"'topprodukte-benzin-diesel'!F64","v":24390},365.84999999999997,{"$f":"J71*Eingabe!$C$48","v":109.75499999999998},"topprodukte.at"]
[{"$f":"'topprodukte-benzin-diesel'!A65","v":"Hyundai"},{"$f":"'topprodukte-benzin-diesel'!B65","v":"i10"},"Hyundai i10 - Benzin",{"$f":"'topprodukte-benzin-diesel'!O65","v":49},{"$f":"'topprodukte-benzin-diesel'!J65","v":"Benzin"},40.991999999999997,{"$f":"'topprodukte-benzin-diesel'!I65","v":4.8},{"$f":"'topprodukte-benzin-diesel'!K65","v":110},{"$f":"'topprodukte-benzin-diesel'!F65","v":10990},164.85,{"$f":"J72*Eingabe!$C$48","v":49.454999999999998},"topprodukte.at"]
[{"$f":"'topprodukte-benzin-diesel'!A66","v":"Hyundai"},{"$f":"'topprodukte-benzin-diesel'!B66","v":"i20"},"Hyundai i20 - Benzin",{"$f":"'topprodukte-benzin-diesel'!O66","v":74},{"$f":"'topprodukte-benzin-diesel'!J66","v":"Benzin"},46.97,{"$f":"'topprodukte-benzin-diesel'!I66","v":5.5},{"$f":"'topprodukte-benzin-diesel'!K66","v":126},{"$f":"'topprodukte-benzin-diesel'!F66","v":17190},257.84999999999997,{"$f":"J73*Eingabe!$C$48","v":77.35499999999999},"topprodukte.at"]
[{"$f":"'topprodukte-benzin-diesel'!A67","v":"Hyundai"},{"$f":"'topprodukte-benzin-diesel'!B67","v":"i30 Combi"},"Hyundai i30 Combi - Benzin",{"$f":"'topprodukte-benzin-diesel'!O67","v":88},{"$f":"'topprodukte-benzin-diesel'!J67","v":"Benzin"},46.116,{"$f":"'topprodukte-benzin-diesel'!I67","v":5.4},{"$f":"'topprodukte-benzin-diesel'!K67","v":123},{"$f":"'topprodukte-benzin-diesel'!F67","v":20590},308.84999999999997,{"$f":"J74*Eingabe!$C$48","v":92.654999999999987},"topprodukte.at"]
[{"$f":"'topprodukte-benzin-diesel'!A68","v":"Hyundai"},{"$f":"'topprodukte-benzin-diesel'!B68","v":"Kona"},"Hyundai Kona - Benzin",{"$f":"'topprodukte-benzin-diesel'!O68","v":88},{"$f":"'topprodukte-benzin-diesel'!J68","v":"Benzin"},52.947999999999993,{"$f":"'topprodukte-benzin-diesel'!I68","v":6.2},{"$f":"'topprodukte-benzin-diesel'!K68","v":142},{"$f":"'topprodukte-benzin-diesel'!F68","v":20690},413.8,{"$f":"J75*Eingabe!$C$48","v":124.14},"topprodukte.at"]
[{"$f":"'topprodukte-benzin-diesel'!A69","v":"Hyundai"},{"$f":"'topprodukte-benzin-diesel'!B69","v":"i30"},"Hyundai i30 - Benzin",{"$f":"'topprodukte-benzin-diesel'!O69","v":85},{"$f":"'topprodukte-benzin-diesel'!J69","v":"Benzin"},39.283999999999992,{"$f":"'topprodukte-benzin-diesel'!I69","v":4.5999999999999996},{"$f":"'topprodukte-benzin-diesel'!K69","v":118},{"$f":"'topprodukte-benzin-diesel'!F69","v":22590},338.84999999999997,{"$f":"J76*Eingabe!$C$48","v":101.65499999999999},"topprodukte.at"]
[{"$f":"'topprodukte-benzin-diesel'!A70","v":"Hyundai"},{"$f":"'topprodukte-benzin-diesel'!B70","v":"i30 CW"},"Hyundai i30 CW - Benzin",{"$f":"'topprodukte-benzin-diesel'!O70","v":85},{"$f":"'topprodukte-benzin-diesel'!J70","v":"Benzin"},38.429999999999993,{"$f":"'topprodukte-benzin-diesel'!I70","v":4.5},{"$f":"'topprodukte-benzin-diesel'!K70","v":118},{"$f":"'topprodukte-benzin-diesel'!F70","v":22590},338.84999999999997,{"$f":"J77*Eingabe!$C$48","v":101.65499999999999},"topprodukte.at"]
[{"$f":"'topprodukte-benzin-diesel'!A71","v":"Hyundai"},{"$f":"'topprodukte-benzin-diesel'!B71","v":"Kona"},"Hyundai Kona - Benzin",{"$f":"'topprodukte-benzin-diesel'!O71","v":85},{"$f":"'topprodukte-benzin-diesel'!J71","v":"Benzin"},42.699999999999996,{"$f":"'topprodukte-benzin-diesel'!I71","v":5},{"$f":"'topprodukte-benzin-diesel'!K71","v":129},{"$f":"'topprodukte-benzin-diesel'!F71","v":22690},340.34999999999997,{"$f":"J78*Eingabe!$C$48","v":102.10499999999999},"topprodukte.at"]
[{"$f":"'topprodukte-benzin-diesel'!A72","v":"Hyundai"},{"$f":"'topprodukte-benzin-diesel'!B72","v":"i30"},"Hyundai i30 - Diesel",{"$f":"'topprodukte-benzin-diesel'!O72","v":85},{"$f":"'topprodukte-benzin-diesel'!J72","v":"Diesel"},46.489899999999999,{"$f":"'topprodukte-benzin-diesel'!I72","v":4.5999999999999996},{"$f":"'topprodukte-benzin-diesel'!K72","v":118},{"$f":"'topprodukte-benzin-diesel'!F72","v":22590},338.84999999999997,{"$f":"J79*Eingabe!$C$48","v":101.65499999999999},"topprodukte.at"]
[{"$f":"'topprodukte-benzin-diesel'!A73","v":"Hyundai"},{"$f":"'topprodukte-benzin-diesel'!B73","v":"i30 CW"},"Hyundai i30 CW - Diesel",{"$f":"'topprodukte-benzin-diesel'!O73","v":85},{"$f":"'topprodukte-benzin-diesel'!J73","v":"Diesel"},45.47925,{"$f":"'topprodukte-benzin-diesel'!I73","v":4.5},{"$f":"'topprodukte-benzin-diesel'!K73","v":118},{"$f":"'topprodukte-benzin-diesel'!F73","v":22590},338.84999999999997,{"$f":"J80*Eingabe!$C$48","v":101.65499999999999},"topprodukte.at"]
[{"$f":"'topprodukte-benzin-diesel'!A74","v":"Hyundai"},{"$f":"'topprodukte-benzin-diesel'!B74","v":"Kona"},"Hyundai Kona - Diesel",{"$f":"'topprodukte-benzin-diesel'!O74","v":85},{"$f":"'topprodukte-benzin-diesel'!J74","v":"Diesel"},50.532499999999999,{"$f":"'topprodukte-benzin-diesel'!I74","v":5},{"$f":"'topprodukte-benzin-diesel'!K74","v":129},{"$f":"'topprodukte-benzin-diesel'!F74","v":22690},340.34999999999997,{"$f":"J81*Eingabe!$C$48","v":102.10499999999999},"topprodukte.at"]
[{"$f":"'topprodukte-benzin-diesel'!A75","v":"KIA"},{"$f":"'topprodukte-benzin-diesel'!B75","v":"Picanto"},"KIA Picanto - Benzin",{"$f":"'topprodukte-benzin-diesel'!O75","v":49},{"$f":"'topprodukte-benzin-diesel'!J75","v":"Benzin"},43.553999999999995,{"$f":"'topprodukte-benzin-diesel'!I75","v":5.0999999999999996},{"$f":"'topprodukte-benzin-diesel'!K75","v":116},{"$f":"'topprodukte-benzin-diesel'!F75","v":10190},152.85,{"$f":"J82*Eingabe!$C$48","v":45.854999999999997},"topprodukte.at"]
[{"$f":"'topprodukte-benzin-diesel'!A76","v":"KIA"},{"$f":"'topprodukte-benzin-diesel'!B76","v":"Rio"},"KIA Rio - Benzin",{"$f":"'topprodukte-benzin-diesel'!O76","v":74},{"$f":"'topprodukte-benzin-diesel'!J76","v":"Benzin"},46.97,{"$f":"'topprodukte-benzin-diesel'!I76","v":5.5},{"$f":"'topprodukte-benzin-diesel'!K76","v":126},{"$f":"'topprodukte-benzin-diesel'!F76","v":18090},271.34999999999997,{"$f":"J83*Eingabe!$C$48","v":81.404999999999987},"topprodukte.at"]
[{"$f":"'topprodukte-benzin-diesel'!A77","v":"KIA"},{"$f":"'topprodukte-benzin-diesel'!B77","v":"Ceed"},"KIA Ceed - Benzin",{"$f":"'topprodukte-benzin-diesel'!O77","v":74},{"$f":"'topprodukte-benzin-diesel'!J77","v":"Benzin"},47.823999999999991,{"$f":"'topprodukte-benzin-diesel'!I77","v":5.6},{"$f":"'topprodukte-benzin-diesel'!K77","v":126},{"$f":"'topprodukte-benzin-diesel'!F77","v":17790},266.84999999999997,{"$f":"J84*Eingabe!$C$48","v":80.054999999999993},"topprodukte.at"]
[{"$f":"'topprodukte-benzin-diesel'!A78","v":"KIA"},{"$f":"'topprodukte-benzin-diesel'!B78","v":"Ceed SW"},"KIA Ceed SW - Benzin",{"$f":"'topprodukte-benzin-diesel'!O78","v":74},{"$f":"'topprodukte-benzin-diesel'!J78","v":"Benzin"},{"$f":"IF(E85=\"Benzin\",$O$3*G85,$O$4*G85)","v":47.823999999999991},{"$f":"'topprodukte-benzin-diesel'!I78","v":5.6},{"$f":"'topprodukte-benzin-diesel'!K78","v":127},{"$f":"'topprodukte-benzin-diesel'!F78","v":18990},284.84999999999997,{"$f":"J85*Eingabe!$C$48","v":85.454999999999984},"topprodukte.at"]
[{"$f":"'topprodukte-benzin-diesel'!A79","v":"KIA"},{"$f":"'topprodukte-benzin-diesel'!B79","v":"ceed SW"},"KIA ceed SW - Benzin",{"$f":"'topprodukte-benzin-diesel'!O79","v":85},{"$f":"'topprodukte-benzin-diesel'!J79","v":"Benzin"},{"$f":"IF(E86=\"Benzin\",$O$3*G86,$O$4*G86)","v":39.283999999999992},{"$f":"'topprodukte-benzin-diesel'!I79","v":4.5999999999999996},{"$f":"'topprodukte-benzin-diesel'!K79","v":121},{"$f":"'topprodukte-benzin-diesel'!F79","v":22790},341.84999999999997,{"$f":"J86*Eingabe!$C$48","v":102.55499999999999},"topprodukte.at"]
[{"$f":"'topprodukte-benzin-diesel'!A80","v":"KIA"},{"$f":"'topprodukte-benzin-diesel'!B80","v":"Sportage"},"KIA Sportage - Benzin",{"$f":"'topprodukte-benzin-diesel'!O80","v":85},{"$f":"'topprodukte-benzin-diesel'!J80","v":"Benzin"},{"$f":"IF(E87=\"Benzin\",$O$3*G87,$O$4*G87)","v":45.261999999999993},{"$f":"'topprodukte-benzin-diesel'!I80","v":5.3},{"$f":"'topprodukte-benzin-diesel'!K80","v":135},{"$f":"'topprodukte-benzin-diesel'!F80","v":31190},467.84999999999997,{"$f":"J87*Eingabe!$C$48","v":140.35499999999999},"topprodukte.at"]
[{"$f":"'topprodukte-benzin-diesel'!A81","v":"KIA"},{"$f":"'topprodukte-benzin-diesel'!B81","v":"ceed SW"},"KIA ceed SW - Diesel",{"$f":"'topprodukte-benzin-diesel'!O81","v":85},{"$f":"'topprodukte-benzin-diesel'!J81","v":"Diesel"},39.4,{"$f":"'topprodukte-benzin-diesel'!I81","v":4.5999999999999996},{"$f":"'topprodukte-benzin-diesel'!K81","v":121},{"$f":"'topprodukte-benzin-diesel'!F81","v":22790},341.84999999999997,{"$f":"J88*Eingabe!$C$48","v":102.55499999999999},"topprodukte.at"]
[{"$f":"'topprodukte-benzin-diesel'!A82","v":"Mazda"},{"$f":"'topprodukte-benzin-diesel'!B82","v":2},"Mazda 2 - Benzin",{"$f":"'topprodukte-benzin-diesel'!O82","v":55},{"$f":"'topprodukte-benzin-diesel'!J82","v":"Benzin"},{"$f":"IF(E89=\"Benzin\",$O$3*G89,$O$4*G89)","v":45.261999999999993},{"$f":"'topprodukte-benzin-diesel'!I82","v":5.3},{"$f":"'topprodukte-benzin-diesel'!K82","v":120},{"$f":"'topprodukte-benzin-diesel'!F82","v":14690},220.35,{"$f":"J89*Eingabe!$C$48","v":66.10499999999999},"topprodukte.at"]
[{"$f":"'topprodukte-benzin-diesel'!A83","v":"Mercedes"},{"$f":"'topprodukte-benzin-diesel'!B83","v":"A-Klasse"},"Mercedes A-Klasse - Benzin",{"$f":"'topprodukte-benzin-diesel'!O83","v":100},{"$f":"'topprodukte-benzin-diesel'!J83","v":"Benzin"},50.385999999999996,{"$f":"'topprodukte-benzin-diesel'!I83","v":5.9},{"$f":"'topprodukte-benzin-diesel'!K83","v":133},{"$f":"'topprodukte-benzin-diesel'!F83","v":29670},445.05,{"$f":"J90*Eingabe!$C$48","v":133.51499999999999},"topprodukte.at"]
[{"$f":"'topprodukte-benzin-diesel'!A84","v":"Mercedes"},{"$f":"'topprodukte-benzin-diesel'!B84","v":"A-Klasse"},"Mercedes A-Klasse - Benzin",{"$f":"'topprodukte-benzin-diesel'!O84","v":70},{"$f":"'topprodukte-benzin-diesel'!J84","v":"Benzin"},38.429999999999993,{"$f":"'topprodukte-benzin-diesel'!I84","v":4.5},{"$f":"'topprodukte-benzin-diesel'!K84","v":118},{"$f":"'topprodukte-benzin-diesel'!F84","v":29590},443.84999999999997,{"$f":"J91*Eingabe!$C$48","v":133.15499999999997},"topprodukte.at"]
[{"$f":"'topprodukte-benzin-diesel'!A85","v":"Mercedes"},{"$f":"'topprodukte-benzin-diesel'!B85","v":"CLA-Klasse"},"Mercedes CLA-Klasse - Benzin",{"$f":"'topprodukte-benzin-diesel'!O85","v":85},{"$f":"'topprodukte-benzin-diesel'!J85","v":"Benzin"},38.429999999999993,{"$f":"'topprodukte-benzin-diesel'!I85","v":4.5},{"$f":"'topprodukte-benzin-diesel'!K85","v":118},{"$f":"'topprodukte-benzin-diesel'!F85","v":35460},531.9,{"$f":"J92*Eingabe!$C$48","v":159.57},"topprodukte.at"]
[{"$f":"'topprodukte-benzin-diesel'!A86","v":"Mercedes"},{"$f":"'topprodukte-benzin-diesel'!B86","v":"C-Klasse"},"Mercedes C-Klasse - Benzin",{"$f":"'topprodukte-benzin-diesel'!O86","v":118},{"$f":"'topprodukte-benzin-diesel'!J86","v":"Benzin"},40.991999999999997,{"$f":"'topprodukte-benzin-diesel'!I86","v":4.8},{"$f":"'topprodukte-benzin-diesel'!K86","v":127},{"$f":"'topprodukte-benzin-diesel'!F86","v":40470},607.04999999999995,{"$f":"J93*Eingabe!$C$48","v":182.11499999999998},"topprodukte.at"]
[{"$f":"'topprodukte-benzin-diesel'!A87","v":"Mercedes"},{"$f":"'topprodukte-benzin-diesel'!B87","v":"A-Klasse"},"Mercedes A-Klasse - Diesel",{"$f":"'topprodukte-benzin-diesel'!O87","v":70},{"$f":"'topprodukte-benzin-diesel'!J87","v":"Diesel"},45.47925,{"$f":"'topprodukte-benzin-diesel'!I87","v":4.5},{"$f":"'topprodukte-benzin-diesel'!K87","v":118},{"$f":"'topprodukte-benzin-diesel'!F87","v":29590},443.84999999999997,{"$f":"J94*Eingabe!$C$48","v":133.15499999999997},"topprodukte.at"]
[{"$f":"'topprodukte-benzin-diesel'!A88","v":"Mercedes"},{"$f":"'topprodukte-benzin-diesel'!B88","v":"CLA-Klasse"},"Mercedes CLA-Klasse - Diesel",{"$f":"'topprodukte-benzin-diesel'!O88","v":85},{"$f":"'topprodukte-benzin-diesel'!J88","v":"Diesel"},45.47925,{"$f":"'topprodukte-benzin-diesel'!I88","v":4.5},{"$f":"'topprodukte-benzin-diesel'!K88","v":118},{"$f":"'topprodukte-benzin-diesel'!F88","v":35460},531.9,{"$f":"J95*Eingabe!$C$48","v":159.57},"topprodukte.at"]
[{"$f":"'topprodukte-benzin-diesel'!A89","v":"Mercedes"},{"$f":"'topprodukte-benzin-diesel'!B89","v":"C-Klasse"},"Mercedes C-Klasse - Diesel",{"$f":"'topprodukte-benzin-diesel'!O89","v":118},{"$f":"'topprodukte-benzin-diesel'!J89","v":"Diesel"},48.511200000000002,{"$f":"'topprodukte-benzin-diesel'!I89","v":4.8},{"$f":"'topprodukte-benzin-diesel'!K89","v":127},{"$f":"'topprodukte-benzin-diesel'!F89","v":40470},607.04999999999995,{"$f":"J96*Eingabe!$C$48","v":182.11499999999998},"topprodukte.at"]
[{"$f":"'topprodukte-benzin-diesel'!A90","v":"Mini"},{"$f":"'topprodukte-benzin-diesel'!B90","v":"Mini 3-Türer"},"Mini Mini 3-Türer - Benzin",{"$f":"'topprodukte-benzin-diesel'!O90","v":55},{"$f":"'topprodukte-benzin-diesel'!J90","v":"Benzin"},49.531999999999996,{"$f":"'topprodukte-benzin-diesel'!I90","v":5.8},{"$f":"'topprodukte-benzin-diesel'!K90","v":133},{"$f":"'topprodukte-benzin-diesel'!F90","v":19750},296.25,{"$f":"J97*Eingabe!$C$48","v":88.875},"topprodukte.at"]
[{"$f":"'topprodukte-benzin-diesel'!A91","v":"Mini"},{"$f":"'topprodukte-benzin-diesel'!B91","v":"Countryman"},"Mini Countryman - Benzin",{"$f":"'topprodukte-benzin-diesel'!O91","v":85},{"$f":"'topprodukte-benzin-diesel'!J91","v":"Benzin"},41.845999999999997,{"$f":"'topprodukte-benzin-diesel'!I91","v":4.9000000000000004},{"$f":"'topprodukte-benzin-diesel'!K91","v":129},{"$f":"'topprodukte-benzin-diesel'!F91","v":28500},427.5,{"$f":"J98*Eingabe!$C$48","v":128.25},"topprodukte.at"]
[{"$f":"'topprodukte-benzin-diesel'!A92","v":"Mini"},{"$f":"'topprodukte-benzin-diesel'!B92","v":"Countryman"},"Mini Countryman - Diesel",{"$f":"'topprodukte-benzin-diesel'!O92","v":85},{"$f":"'topprodukte-benzin-diesel'!J92","v":"Diesel"},49.521850000000008,{"$f":"'topprodukte-benzin-diesel'!I92","v":4.9000000000000004},{"$f":"'topprodukte-benzin-diesel'!K92","v":129},{"$f":"'topprodukte-benzin-diesel'!F92","v":28500},427.5,{"$f":"J99*Eingabe!$C$48","v":128.25},"topprodukte.at"]
[{"$f":"'topprodukte-benzin-diesel'!A93","v":"MItsubishi"},{"$f":"'topprodukte-benzin-diesel'!B93","v":"Space Star"},"MItsubishi Space Star - Benzin",{"$f":"'topprodukte-benzin-diesel'!O93","v":52},{"$f":"'topprodukte-benzin-diesel'!J93","v":"Benzin"},43.553999999999995,{"$f":"'topprodukte-benzin-diesel'!I93","v":5.0999999999999996},{"$f":"'topprodukte-benzin-diesel'!K93","v":115},{"$f":"'topprodukte-benzin-diesel'!F93","v":12990},194.85,{"$f":"J100*Eingabe!$C$48","v":58.454999999999998},"topprodukte.at"]
[{"$f":"'topprodukte-benzin-diesel'!A94","v":"Nissan"},{"$f":"'topprodukte-benzin-diesel'!B94","v":"Micra"},"Nissan Micra - Benzin",{"$f":"'topprodukte-benzin-diesel'!O94","v":74},{"$f":"'topprodukte-benzin-diesel'!J94","v":"Benzin"},47.823999999999991,{"$f":"'topprodukte-benzin-diesel'!I94","v":5.6},{"$f":"'topprodukte-benzin-diesel'!K94","v":126},{"$f":"'topprodukte-benzin-diesel'!F94","v":15090},{"$f":"IF(H101>$U$4,IF(I101*0.02>960,960,I101*0.02),IF(H101>0,IF(I101*0.015>720,720,I101*0.015),0))","v":226.35},{"$f":"J101*Eingabe!$C$48","v":67.905000000000001},"topprodukte.at"]
[{"$f":"'topprodukte-benzin-diesel'!A95","v":"Nissan"},{"$f":"'topprodukte-benzin-diesel'!B95","v":"Juke"},"Nissan Juke - Benzin",{"$f":"'topprodukte-benzin-diesel'!O95","v":86},{"$f":"'topprodukte-benzin-diesel'!J95","v":"Benzin"},50.385999999999996,{"$f":"'topprodukte-benzin-diesel'!I95","v":5.9},{"$f":"'topprodukte-benzin-diesel'!K95","v":135},{"$f":"'topprodukte-benzin-diesel'!F95","v":19600},294,{"$f":"J102*Eingabe!$C$48","v":88.2},"topprodukte.at"]
[{"$f":"'topprodukte-benzin-diesel'!A96","v":"Opel"},{"$f":"'topprodukte-benzin-diesel'!B96","v":"Astra"},"Opel Astra - Benzin",{"$f":"'topprodukte-benzin-diesel'!O96","v":81},{"$f":"'topprodukte-benzin-diesel'!J96","v":"Benzin"},44.407999999999994,{"$f":"'topprodukte-benzin-diesel'!I96","v":5.2},{"$f":"'topprodukte-benzin-diesel'!K96","v":119},{"$f":"'topprodukte-benzin-diesel'!F96","v":21739},326.08499999999998,{"$f":"J103*Eingabe!$C$48","v":97.825499999999991},"topprodukte.at"]
[{"$f":"'topprodukte-benzin-diesel'!A97","v":"Opel"},{"$f":"'topprodukte-benzin-diesel'!B97","v":"Corsa"},"Opel Corsa - Benzin",{"$f":"'topprodukte-benzin-diesel'!O97","v":55},{"$f":"'topprodukte-benzin-diesel'!J97","v":"Benzin"},46.116,{"$f":"'topprodukte-benzin-diesel'!I97","v":5.4},{"$f":"'topprodukte-benzin-diesel'!K97","v":123},{"$f":"'topprodukte-benzin-diesel'!F97","v":14999},224.98499999999999,{"$f":"J104*Eingabe!$C$48","v":67.495499999999993},"topprodukte.at"]
[{"$f":"'topprodukte-benzin-diesel'!A98","v":"Opel"},{"$f":"'topprodukte-benzin-diesel'!B98","v":"Astra ST"},"Opel Astra ST - Benzin",{"$f":"'topprodukte-benzin-diesel'!O98","v":81},{"$f":"'topprodukte-benzin-diesel'!J98","v":"Benzin"},46.116,{"$f":"'topprodukte-benzin-diesel'!I98","v":5.4},{"$f":"'topprodukte-benzin-diesel'!K98","v":122},{"$f":"'topprodukte-benzin-diesel'!F98","v":23339},350.08499999999998,{"$f":"J105*Eingabe!$C$48","v":105.02549999999999},"topprodukte.at"]
[{"$f":"'topprodukte-benzin-diesel'!A99","v":"Opel"},{"$f":"'topprodukte-benzin-diesel'!B99","v":"Insignia"},"Opel Insignia - Benzin",{"$f":"'topprodukte-benzin-diesel'!O99","v":103},{"$f":"'topprodukte-benzin-diesel'!J99","v":"Benzin"},52.093999999999994,{"$f":"'topprodukte-benzin-diesel'!I99","v":6.1},{"$f":"'topprodukte-benzin-diesel'!K99","v":138},{"$f":"'topprodukte-benzin-diesel'!F99","v":30730},460.95,{"$f":"J106*Eingabe!$C$48","v":138.285},"topprodukte.at"]
[{"$f":"'topprodukte-benzin-diesel'!A100","v":"Opel"},{"$f":"'topprodukte-benzin-diesel'!B100","v":"Crossland X"},"Opel Crossland X - Benzin",{"$f":"'topprodukte-benzin-diesel'!O100","v":60},{"$f":"'topprodukte-benzin-diesel'!J100","v":"Benzin"},52.947999999999993,{"$f":"'topprodukte-benzin-diesel'!I100","v":6.2},{"$f":"'topprodukte-benzin-diesel'!K100","v":139},{"$f":"'topprodukte-benzin-diesel'!F100","v":19839},396.78000000000003,{"$f":"J107*Eingabe!$C$48","v":119.03400000000001},"topprodukte.at"]
[{"$f":"'topprodukte-benzin-diesel'!A101","v":"Opel"},{"$f":"'topprodukte-benzin-diesel'!B101","v":"Grandland X"},"Opel Grandland X - Benzin",{"$f":"'topprodukte-benzin-diesel'!O101","v":96},{"$f":"'topprodukte-benzin-diesel'!J101","v":"Benzin"},54.655999999999999,{"$f":"'topprodukte-benzin-diesel'!I101","v":6.4},{"$f":"'topprodukte-benzin-diesel'!K101","v":145},{"$f":"'topprodukte-benzin-diesel'!F101","v":26729},534.58000000000004,{"$f":"J108*Eingabe!$C$48","v":160.374},"topprodukte.at"]
[{"$f":"'topprodukte-benzin-diesel'!A102","v":"Opel"},{"$f":"'topprodukte-benzin-diesel'!B102","v":"Corsa"},"Opel Corsa - Benzin",{"$f":"'topprodukte-benzin-diesel'!O102","v":75},{"$f":"'topprodukte-benzin-diesel'!J102","v":"Benzin"},35.013999999999996,{"$f":"'topprodukte-benzin-diesel'!I102","v":4.0999999999999996},{"$f":"'topprodukte-benzin-diesel'!K102","v":107},{"$f":"'topprodukte-benzin-diesel'!F102","v":20389},305.83499999999998,{"$f":"J109*Eingabe!$C$48","v":91.750499999999988},"topprodukte.at"]
[{"$f":"'topprodukte-benzin-diesel'!A103","v":"Opel"},{"$f":"'topprodukte-benzin-diesel'!B103","v":"Astra"},"Opel Astra - Benzin",{"$f":"'topprodukte-benzin-diesel'!O103","v":77},{"$f":"'topprodukte-benzin-diesel'!J103","v":"Benzin"},36.721999999999994,{"$f":"'topprodukte-benzin-diesel'!I103","v":4.3},{"$f":"'topprodukte-benzin-diesel'!K103","v":112},{"$f":"'topprodukte-benzin-diesel'!F103","v":23739},356.08499999999998,{"$f":"J110*Eingabe!$C$48","v":106.82549999999999},"topprodukte.at"]
[{"$f":"'topprodukte-benzin-diesel'!A104","v":"Opel"},{"$f":"'topprodukte-benzin-diesel'!B104","v":"Astra Sports Tourer"},"Opel Astra Sports Tourer - Benzin",{"$f":"'topprodukte-benzin-diesel'!O104","v":77},{"$f":"'topprodukte-benzin-diesel'!J104","v":"Benzin"},36.721999999999994,{"$f":"'topprodukte-benzin-diesel'!I104","v":4.3},{"$f":"'topprodukte-benzin-diesel'!K104","v":113},{"$f":"'topprodukte-benzin-diesel'!F104","v":25339},380.08499999999998,{"$f":"J111*Eingabe!$C$48","v":114.02549999999999},"topprodukte.at"]
[{"$f":"'topprodukte-benzin-diesel'!A105","v":"Opel"},{"$f":"'topprodukte-benzin-diesel'!B105","v":"Insignia "},"Opel Insignia  - Benzin",{"$f":"'topprodukte-benzin-diesel'!O105","v":90},{"$f":"'topprodukte-benzin-diesel'!J105","v":"Benzin"},39.283999999999992,{"$f":"'topprodukte-benzin-diesel'!I105","v":4.5999999999999996},{"$f":"'topprodukte-benzin-diesel'!K105","v":121},{"$f":"'topprodukte-benzin-diesel'!F105","v":32699},490.48499999999996,{"$f":"J112*Eingabe!$C$48","v":147.14549999999997},"topprodukte.at"]
[{"$f":"'topprodukte-benzin-diesel'!A106","v":"Opel"},{"$f":"'topprodukte-benzin-diesel'!B106","v":"Crossland X"},"Opel Crossland X - Benzin",{"$f":"'topprodukte-benzin-diesel'!O106","v":75},{"$f":"'topprodukte-benzin-diesel'!J106","v":"Benzin"},40.137999999999998,{"$f":"'topprodukte-benzin-diesel'!I106","v":4.7},{"$f":"'topprodukte-benzin-diesel'!K106","v":123},{"$f":"'topprodukte-benzin-diesel'!F106","v":22349},335.23500000000001,{"$f":"J113*Eingabe!$C$48","v":100.5705},"topprodukte.at"]
[{"$f":"'topprodukte-benzin-diesel'!A107","v":"Opel"},{"$f":"'topprodukte-benzin-diesel'!B107","v":"Grandland X"},"Opel Grandland X - Benzin",{"$f":"'topprodukte-benzin-diesel'!O107","v":96},{"$f":"'topprodukte-benzin-diesel'!J107","v":"Benzin"},44.407999999999994,{"$f":"'topprodukte-benzin-diesel'!I107","v":5.2},{"$f":"'topprodukte-benzin-diesel'!K107","v":136},{"$f":"'topprodukte-benzin-diesel'!F107","v":29309},439.63499999999999,{"$f":"J114*Eingabe!$C$48","v":131.8905},"topprodukte.at"]
[{"$f":"'topprodukte-benzin-diesel'!A108","v":"Opel"},{"$f":"'topprodukte-benzin-diesel'!B108","v":"Corsa"},"Opel Corsa - Diesel",{"$f":"'topprodukte-benzin-diesel'!O108","v":75},{"$f":"'topprodukte-benzin-diesel'!J108","v":"Diesel"},41.43665,{"$f":"'topprodukte-benzin-diesel'!I108","v":4.0999999999999996},{"$f":"'topprodukte-benzin-diesel'!K108","v":107},{"$f":"'topprodukte-benzin-diesel'!F108","v":20389},305.83499999999998,{"$f":"J115*Eingabe!$C$48","v":91.750499999999988},"topprodukte.at"]
[{"$f":"'topprodukte-benzin-diesel'!A109","v":"Opel"},{"$f":"'topprodukte-benzin-diesel'!B109","v":"Astra"},"Opel Astra - Diesel",{"$f":"'topprodukte-benzin-diesel'!O109","v":77},{"$f":"'topprodukte-benzin-diesel'!J109","v":"Diesel"},43.457949999999997,{"$f":"'topprodukte-benzin-diesel'!I109","v":4.3},{"$f":"'topprodukte-benzin-diesel'!K109","v":112},{"$f":"'topprodukte-benzin-diesel'!F109","v":23739},356.08499999999998,{"$f":"J116*Eingabe!$C$48","v":106.82549999999999},"topprodukte.at"]
[{"$f":"'topprodukte-benzin-diesel'!A110","v":"Opel"},{"$f":"'topprodukte-benzin-diesel'!B110","v":"Astra Sports Tourer"},"Opel Astra Sports Tourer - Diesel",{"$f":"'topprodukte-benzin-diesel'!O110","v":77},{"$f":"'topprodukte-benzin-diesel'!J110","v":"Diesel"},43.457949999999997,{"$f":"'topprodukte-benzin-diesel'!I110","v":4.3},{"$f":"'topprodukte-benzin-diesel'!K110","v":113},{"$f":"'topprodukte-benzin-diesel'!F110","v":25339},380.08499999999998,{"$f":"J117*Eingabe!$C$48","v":114.02549999999999},"topprodukte.at"]
[{"$f":"'topprodukte-benzin-diesel'!A111","v":"Opel"},{"$f":"'topprodukte-benzin-diesel'!B111","v":"Insignia"},"Opel Insignia - Diesel",{"$f":"'topprodukte-benzin-diesel'!O111","v":90},{"$f":"'topprodukte-benzin-diesel'!J111","v":"Diesel"},46.489899999999999,{"$f":"'topprodukte-benzin-diesel'!I111","v":4.5999999999999996},{"$f":"'topprodukte-benzin-diesel'!K111","v":121},{"$f":"'topprodukte-benzin-diesel'!F111","v":32699},490.48499999999996,{"$f":"J118*Eingabe!$C$48","v":147.14549999999997},"topprodukte.at"]
[{"$f":"'topprodukte-benzin-diesel'!A112","v":"Peugeot"},{"$f":"'topprodukte-benzin-diesel'!B112","v":208},"Peugeot 208 - Benzin",{"$f":"'topprodukte-benzin-diesel'!O112","v":55},{"$f":"'topprodukte-benzin-diesel'!J112","v":"Benzin"},46.116,{"$f":"'topprodukte-benzin-diesel'!I112","v":5.4},{"$f":"'topprodukte-benzin-diesel'!K112","v":123},{"$f":"'topprodukte-benzin-diesel'!F112","v":15990},239.85,{"$f":"J119*Eingabe!$C$48","v":71.954999999999998},"topprodukte.at"]
[{"$f":"'topprodukte-benzin-diesel'!A113","v":"Peugeot"},{"$f":"'topprodukte-benzin-diesel'!B113","v":"308 SW"},"Peugeot 308 SW - Benzin",{"$f":"'topprodukte-benzin-diesel'!O113","v":81},{"$f":"'topprodukte-benzin-diesel'!J113","v":"Benzin"},50.385999999999996,{"$f":"'topprodukte-benzin-diesel'!I113","v":5.9},{"$f":"'topprodukte-benzin-diesel'!K113","v":134},{"$f":"'topprodukte-benzin-diesel'!F113","v":23600},354,{"$f":"J120*Eingabe!$C$48","v":106.2},"topprodukte.at"]
[{"$f":"'topprodukte-benzin-diesel'!A114","v":"Peugeot"},{"$f":"'topprodukte-benzin-diesel'!B114","v":508},"Peugeot 508 - Benzin",{"$f":"'topprodukte-benzin-diesel'!O114","v":133},{"$f":"'topprodukte-benzin-diesel'!J114","v":"Benzin"},{"$f":"IF(E121=\"Benzin\",$O$3*G121,$O$4*G121)","v":55.509999999999991},{"$f":"'topprodukte-benzin-diesel'!I114","v":6.5},{"$f":"'topprodukte-benzin-diesel'!K114","v":145},{"$f":"'topprodukte-benzin-diesel'!F114","v":42250},845,{"$f":"J121*Eingabe!$C$48","v":253.5},"topprodukte.at"]
[{"$f":"'topprodukte-benzin-diesel'!A115","v":"Peugeot"},{"$f":"'topprodukte-benzin-diesel'!B115","v":3008},"Peugeot 3008 - Benzin",{"$f":"'topprodukte-benzin-diesel'!O115","v":96},{"$f":"'topprodukte-benzin-diesel'!J115","v":"Benzin"},53.801999999999992,{"$f":"'topprodukte-benzin-diesel'!I115","v":6.3},{"$f":"'topprodukte-benzin-diesel'!K115","v":144},{"$f":"'topprodukte-benzin-diesel'!F115","v":26790},535.79999999999995,{"$f":"J122*Eingabe!$C$48","v":160.73999999999998},"topprodukte.at"]
[{"$f":"'topprodukte-benzin-diesel'!A116","v":"Peugeot"},{"$f":"'topprodukte-benzin-diesel'!B116","v":5008},"Peugeot 5008 - Benzin",{"$f":"'topprodukte-benzin-diesel'!O116","v":96},{"$f":"'topprodukte-benzin-diesel'!J116","v":"Benzin"},55.509999999999991,{"$f":"'topprodukte-benzin-diesel'!I116","v":6.5},{"$f":"'topprodukte-benzin-diesel'!K116","v":147},{"$f":"'topprodukte-benzin-diesel'!F116","v":28790},575.80000000000007,{"$f":"J123*Eingabe!$C$48","v":172.74},"topprodukte.at"]
[{"$f":"'topprodukte-benzin-diesel'!A117","v":"Peugeot"},{"$f":"'topprodukte-benzin-diesel'!B117","v":208},"Peugeot 208 - Benzin",{"$f":"'topprodukte-benzin-diesel'!O117","v":75},{"$f":"'topprodukte-benzin-diesel'!J117","v":"Benzin"},35.013999999999996,{"$f":"'topprodukte-benzin-diesel'!I117","v":4.0999999999999996},{"$f":"'topprodukte-benzin-diesel'!K117","v":108},{"$f":"'topprodukte-benzin-diesel'!F117","v":19530},292.95,{"$f":"J124*Eingabe!$C$48","v":87.884999999999991},"topprodukte.at"]
[{"$f":"'topprodukte-benzin-diesel'!A118","v":"Peugeot"},{"$f":"'topprodukte-benzin-diesel'!B118","v":308},"Peugeot 308 - Benzin",{"$f":"'topprodukte-benzin-diesel'!O118","v":75},{"$f":"'topprodukte-benzin-diesel'!J118","v":"Benzin"},38.429999999999993,{"$f":"'topprodukte-benzin-diesel'!I118","v":4.5},{"$f":"'topprodukte-benzin-diesel'!K118","v":118},{"$f":"'topprodukte-benzin-diesel'!F118","v":23850},357.75,{"$f":"J125*Eingabe!$C$48","v":107.325},"topprodukte.at"]
[{"$f":"'topprodukte-benzin-diesel'!A119","v":"Peugeot"},{"$f":"'topprodukte-benzin-diesel'!B119","v":508},"Peugeot 508 - Benzin",{"$f":"'topprodukte-benzin-diesel'!O119","v":96},{"$f":"'topprodukte-benzin-diesel'!J119","v":"Benzin"},40.137999999999998,{"$f":"'topprodukte-benzin-diesel'!I119","v":4.7},{"$f":"'topprodukte-benzin-diesel'!K119","v":120},{"$f":"'topprodukte-benzin-diesel'!F119","v":36750},551.25,{"$f":"J126*Eingabe!$C$48","v":165.375},"topprodukte.at"]
[{"$f":"'topprodukte-benzin-diesel'!A120","v":"Peugeot"},{"$f":"'topprodukte-benzin-diesel'!B120","v":"308 SW"},"Peugeot 308 SW - Benzin",{"$f":"'topprodukte-benzin-diesel'!O120","v":96},{"$f":"'topprodukte-benzin-diesel'!J120","v":"Benzin"},40.137999999999998,{"$f":"'topprodukte-benzin-diesel'!I120","v":4.7},{"$f":"'topprodukte-benzin-diesel'!K120","v":122},{"$f":"'topprodukte-benzin-diesel'!F120","v":27800},417,{"$f":"J127*Eingabe!$C$48","v":125.1},"topprodukte.at"]
[{"$f":"'topprodukte-benzin-diesel'!A121","v":"Peugeot"},{"$f":"'topprodukte-benzin-diesel'!B121","v":2008},"Peugeot 2008 - Benzin",{"$f":"'topprodukte-benzin-diesel'!O121","v":75},{"$f":"'topprodukte-benzin-diesel'!J121","v":"Benzin"},38.429999999999993,{"$f":"'topprodukte-benzin-diesel'!I121","v":4.5},{"$f":"'topprodukte-benzin-diesel'!K121","v":118},{"$f":"'topprodukte-benzin-diesel'!F121","v":25510},382.65,{"$f":"J128*Eingabe!$C$48","v":114.79499999999999},"topprodukte.at"]
[{"$f":"'topprodukte-benzin-diesel'!A122","v":"Peugeot"},{"$f":"'topprodukte-benzin-diesel'!B122","v":3008},"Peugeot 3008 - Benzin",{"$f":"'topprodukte-benzin-diesel'!O122","v":96},{"$f":"'topprodukte-benzin-diesel'!J122","v":"Benzin"},44.407999999999994,{"$f":"'topprodukte-benzin-diesel'!I122","v":5.2},{"$f":"'topprodukte-benzin-diesel'!K122","v":136},{"$f":"'topprodukte-benzin-diesel'!F122","v":33000},495,{"$f":"J129*Eingabe!$C$48","v":148.5},"topprodukte.at"]
[{"$f":"'topprodukte-benzin-diesel'!A123","v":"Peugeot"},{"$f":"'topprodukte-benzin-diesel'!B123","v":5008},"Peugeot 5008 - Benzin",{"$f":"'topprodukte-benzin-diesel'!O123","v":96},{"$f":"'topprodukte-benzin-diesel'!J123","v":"Benzin"},45.261999999999993,{"$f":"'topprodukte-benzin-diesel'!I123","v":5.3},{"$f":"'topprodukte-benzin-diesel'!K123","v":137},{"$f":"'topprodukte-benzin-diesel'!F123","v":34900},523.5,{"$f":"J130*Eingabe!$C$48","v":157.04999999999998},"topprodukte.at"]
[{"$f":"'topprodukte-benzin-diesel'!A124","v":"Peugeot"},{"$f":"'topprodukte-benzin-diesel'!B124","v":208},"Peugeot 208 - Diesel",{"$f":"'topprodukte-benzin-diesel'!O124","v":75},{"$f":"'topprodukte-benzin-diesel'!J124","v":"Diesel"},41.43665,{"$f":"'topprodukte-benzin-diesel'!I124","v":4.0999999999999996},{"$f":"'topprodukte-benzin-diesel'!K124","v":108},{"$f":"'topprodukte-benzin-diesel'!F124","v":19530},292.95,{"$f":"J131*Eingabe!$C$48","v":87.884999999999991},"topprodukte.at"]
[{"$f":"'topprodukte-benzin-diesel'!A125","v":"Peugeot"},{"$f":"'topprodukte-benzin-diesel'!B125","v":308},"Peugeot 308 - Diesel",{"$f":"'topprodukte-benzin-diesel'!O125","v":75},{"$f":"'topprodukte-benzin-diesel'!J125","v":"Diesel"},45.47925,{"$f":"'topprodukte-benzin-diesel'!I125","v":4.5},{"$f":"'topprodukte-benzin-diesel'!K125","v":118},{"$f":"'topprodukte-benzin-diesel'!F125","v":23850},357.75,{"$f":"J132*Eingabe!$C$48","v":107.325},"topprodukte.at"]
[{"$f":"'topprodukte-benzin-diesel'!A126","v":"Peugeot"},{"$f":"'topprodukte-benzin-diesel'!B126","v":508},"Peugeot 508 - Diesel",{"$f":"'topprodukte-benzin-diesel'!O126","v":96},{"$f":"'topprodukte-benzin-diesel'!J126","v":"Diesel"},47.500550000000004,{"$f":"'topprodukte-benzin-diesel'!I126","v":4.7},{"$f":"'topprodukte-benzin-diesel'!K126","v":120},{"$f":"'topprodukte-benzin-diesel'!F126","v":36750},551.25,{"$f":"J133*Eingabe!$C$48","v":165.375},"topprodukte.at"]
[{"$f":"'topprodukte-benzin-diesel'!A127","v":"Peugeot"},{"$f":"'topprodukte-benzin-diesel'!B127","v":"308 SW"},{"$f":"CONCATENATE(A134,\" \",B134,\" - \",E134)","v":"Peugeot 308 SW - Diesel"},{"$f":"'topprodukte-benzin-diesel'!O127","v":96},{"$f":"'topprodukte-benzin-diesel'!J127","v":"Diesel"},47.500550000000004,{"$f":"'topprodukte-benzin-diesel'!I127","v":4.7},{"$f":"'topprodukte-benzin-diesel'!K127","v":122},{"$f":"'topprodukte-benzin-diesel'!F127","v":27800},417,{"$f":"J134*Eingabe!$C$48","v":125.1},"topprodukte.at"]
[{"$f":"'topprodukte-benzin-diesel'!A128","v":"Peugeot"},{"$f":"'topprodukte-benzin-diesel'!B128","v":2008},"Peugeot 2008 - Diesel",{"$f":"'topprodukte-benzin-diesel'!O128","v":75},{"$f":"'topprodukte-benzin-diesel'!J128","v":"Diesel"},45.47925,{"$f":"'topprodukte-benzin-diesel'!I128","v":4.5},{"$f":"'topprodukte-benzin-diesel'!K128","v":118},{"$f":"'topprodukte-benzin-diesel'!F128","v":25510},382.65,{"$f":"J135*Eingabe!$C$48","v":114.79499999999999},"topprodukte.at"]
[{"$f":"'topprodukte-benzin-diesel'!A129","v":"Peugeot "},{"$f":"'topprodukte-benzin-diesel'!B129","v":108},"Peugeot  108 - Benzin",{"$f":"'topprodukte-benzin-diesel'!O129","v":53},{"$f":"'topprodukte-benzin-diesel'!J129","v":"Benzin"},40.991999999999997,{"$f":"'topprodukte-benzin-diesel'!I129","v":4.8},{"$f":"'topprodukte-benzin-diesel'!K129","v":109},{"$f":"'topprodukte-benzin-diesel'!F129","v":12740},191.1,{"$f":"J136*Eingabe!$C$48","v":57.33},"topprodukte.at"]
[{"$f":"'topprodukte-benzin-diesel'!A130","v":"Renault"},{"$f":"'topprodukte-benzin-diesel'!B130","v":"Twingo"},"Renault Twingo - Benzin",{"$f":"'topprodukte-benzin-diesel'!O130","v":54},{"$f":"'topprodukte-benzin-diesel'!J130","v":"Benzin"},45.261999999999993,{"$f":"'topprodukte-benzin-diesel'!I130","v":5.3},{"$f":"'topprodukte-benzin-diesel'!K130","v":119},{"$f":"'topprodukte-benzin-diesel'!F130","v":9990},149.85,{"$f":"J137*Eingabe!$C$48","v":44.954999999999998},"topprodukte.at"]
[{"$f":"'topprodukte-benzin-diesel'!A131","v":"Renault"},{"$f":"'topprodukte-benzin-diesel'!B131","v":"Clio"},"Renault Clio - Benzin",{"$f":"'topprodukte-benzin-diesel'!O131","v":53},{"$f":"'topprodukte-benzin-diesel'!J131","v":"Benzin"},46.116,{"$f":"'topprodukte-benzin-diesel'!I131","v":5.4},{"$f":"'topprodukte-benzin-diesel'!K131","v":120},{"$f":"'topprodukte-benzin-diesel'!F131","v":12940},194.1,{"$f":"J138*Eingabe!$C$48","v":58.23},"topprodukte.at"]
[{"$f":"'topprodukte-benzin-diesel'!A132","v":"Renault"},{"$f":"'topprodukte-benzin-diesel'!B132","v":"Megane Grandtour"},"Renault Megane Grandtour - Benzin",{"$f":"'topprodukte-benzin-diesel'!O132","v":84},{"$f":"'topprodukte-benzin-diesel'!J132","v":"Benzin"},50.385999999999996,{"$f":"'topprodukte-benzin-diesel'!I132","v":5.9},{"$f":"'topprodukte-benzin-diesel'!K132","v":135},{"$f":"'topprodukte-benzin-diesel'!F132","v":19290},289.34999999999997,{"$f":"J139*Eingabe!$C$48","v":86.804999999999993},"topprodukte.at"]
[{"$f":"'topprodukte-benzin-diesel'!A133","v":"Renault"},{"$f":"'topprodukte-benzin-diesel'!B133","v":"Captur"},"Renault Captur - Benzin",{"$f":"'topprodukte-benzin-diesel'!O133","v":74},{"$f":"'topprodukte-benzin-diesel'!J133","v":"Benzin"},50.385999999999996,{"$f":"'topprodukte-benzin-diesel'!I133","v":5.9},{"$f":"'topprodukte-benzin-diesel'!K133","v":134},{"$f":"'topprodukte-benzin-diesel'!F133","v":18540},278.09999999999997,{"$f":"J140*Eingabe!$C$48","v":83.429999999999993},"topprodukte.at"]
[{"$f":"'topprodukte-benzin-diesel'!A134","v":"Renault"},{"$f":"'topprodukte-benzin-diesel'!B134","v":"Kadjar"},"Renault Kadjar - Benzin",{"$f":"'topprodukte-benzin-diesel'!O134","v":103},{"$f":"'topprodukte-benzin-diesel'!J134","v":"Benzin"},55.509999999999991,{"$f":"'topprodukte-benzin-diesel'!I134","v":6.5},{"$f":"'topprodukte-benzin-diesel'!K134","v":146},{"$f":"'topprodukte-benzin-diesel'!F134","v":22890},457.8,{"$f":"J141*Eingabe!$C$48","v":137.34},"topprodukte.at"]
[{"$f":"'topprodukte-benzin-diesel'!A135","v":"Renault"},{"$f":"'topprodukte-benzin-diesel'!B135","v":"Scenic"},"Renault Scenic - Benzin",{"$f":"'topprodukte-benzin-diesel'!O135","v":85},{"$f":"'topprodukte-benzin-diesel'!J135","v":"Benzin"},56.36399999999999,{"$f":"'topprodukte-benzin-diesel'!I135","v":6.6},{"$f":"'topprodukte-benzin-diesel'!K135","v":149},{"$f":"'topprodukte-benzin-diesel'!F135","v":21390},427.8,{"$f":"J142*Eingabe!$C$48","v":128.34},"topprodukte.at"]
[{"$f":"'topprodukte-benzin-diesel'!A136","v":"Renault"},{"$f":"'topprodukte-benzin-diesel'!B136","v":"Clio"},"Renault Clio - Benzin",{"$f":"'topprodukte-benzin-diesel'!O136","v":63},{"$f":"'topprodukte-benzin-diesel'!J136","v":"Benzin"},35.867999999999995,{"$f":"'topprodukte-benzin-diesel'!I136","v":4.2},{"$f":"'topprodukte-benzin-diesel'!K136","v":109},{"$f":"'topprodukte-benzin-diesel'!F136","v":18790},281.84999999999997,{"$f":"J143*Eingabe!$C$48","v":84.554999999999993},"topprodukte.at"]
[{"$f":"'topprodukte-benzin-diesel'!A137","v":"Renault"},{"$f":"'topprodukte-benzin-diesel'!B137","v":"Megane"},"Renault Megane - Benzin",{"$f":"'topprodukte-benzin-diesel'!O137","v":85},{"$f":"'topprodukte-benzin-diesel'!J137","v":"Benzin"},38.429999999999993,{"$f":"'topprodukte-benzin-diesel'!I137","v":4.5},{"$f":"'topprodukte-benzin-diesel'!K137","v":117},{"$f":"'topprodukte-benzin-diesel'!F137","v":24090},361.34999999999997,{"$f":"J144*Eingabe!$C$48","v":108.40499999999999},"topprodukte.at"]
[{"$f":"'topprodukte-benzin-diesel'!A138","v":"Renault"},{"$f":"'topprodukte-benzin-diesel'!B138","v":"Megane Grandtour"},"Renault Megane Grandtour - Benzin",{"$f":"'topprodukte-benzin-diesel'!O138","v":85},{"$f":"'topprodukte-benzin-diesel'!J138","v":"Benzin"},38.429999999999993,{"$f":"'topprodukte-benzin-diesel'!I138","v":4.5},{"$f":"'topprodukte-benzin-diesel'!K138","v":118},{"$f":"'topprodukte-benzin-diesel'!F138","v":25090},376.34999999999997,{"$f":"J145*Eingabe!$C$48","v":112.90499999999999},"topprodukte.at"]
[{"$f":"'topprodukte-benzin-diesel'!A139","v":"Renault"},{"$f":"'topprodukte-benzin-diesel'!B139","v":"Captur"},"Renault Captur - Benzin",{"$f":"'topprodukte-benzin-diesel'!O139","v":85},{"$f":"'topprodukte-benzin-diesel'!J139","v":"Benzin"},40.137999999999998,{"$f":"'topprodukte-benzin-diesel'!I139","v":4.7},{"$f":"'topprodukte-benzin-diesel'!K139","v":123},{"$f":"'topprodukte-benzin-diesel'!F139","v":24890},373.34999999999997,{"$f":"J146*Eingabe!$C$48","v":112.00499999999998},"topprodukte.at"]
[{"$f":"'topprodukte-benzin-diesel'!A140","v":"Renault"},{"$f":"'topprodukte-benzin-diesel'!B140","v":"Kadjar"},"Renault Kadjar - Benzin",{"$f":"'topprodukte-benzin-diesel'!O140","v":85},{"$f":"'topprodukte-benzin-diesel'!J140","v":"Benzin"},42.699999999999996,{"$f":"'topprodukte-benzin-diesel'!I140","v":5},{"$f":"'topprodukte-benzin-diesel'!K140","v":131},{"$f":"'topprodukte-benzin-diesel'!F140","v":27090},406.34999999999997,{"$f":"J147*Eingabe!$C$48","v":121.90499999999999},"topprodukte.at"]
[{"$f":"'topprodukte-benzin-diesel'!A141","v":"Renault"},{"$f":"'topprodukte-benzin-diesel'!B141","v":"Clio"},"Renault Clio - Diesel",{"$f":"'topprodukte-benzin-diesel'!O141","v":63},{"$f":"'topprodukte-benzin-diesel'!J141","v":"Diesel"},42.447300000000006,{"$f":"'topprodukte-benzin-diesel'!I141","v":4.2},{"$f":"'topprodukte-benzin-diesel'!K141","v":109},{"$f":"'topprodukte-benzin-diesel'!F141","v":18790},281.84999999999997,{"$f":"J148*Eingabe!$C$48","v":84.554999999999993},"topprodukte.at"]
[{"$f":"'topprodukte-benzin-diesel'!A142","v":"Renault"},{"$f":"'topprodukte-benzin-diesel'!B142","v":"Megane"},"Renault Megane - Diesel",{"$f":"'topprodukte-benzin-diesel'!O142","v":85},{"$f":"'topprodukte-benzin-diesel'!J142","v":"Diesel"},45.47925,{"$f":"'topprodukte-benzin-diesel'!I142","v":4.5},{"$f":"'topprodukte-benzin-diesel'!K142","v":117},{"$f":"'topprodukte-benzin-diesel'!F142","v":24090},361.34999999999997,{"$f":"J149*Eingabe!$C$48","v":108.40499999999999},"topprodukte.at"]
[{"$f":"'topprodukte-benzin-diesel'!A143","v":"Renault"},{"$f":"'topprodukte-benzin-diesel'!B143","v":"Megane Grandtour"},"Renault Megane Grandtour - Diesel",{"$f":"'topprodukte-benzin-diesel'!O143","v":85},{"$f":"'topprodukte-benzin-diesel'!J143","v":"Diesel"},45.47925,{"$f":"'topprodukte-benzin-diesel'!I143","v":4.5},{"$f":"'topprodukte-benzin-diesel'!K143","v":118},{"$f":"'topprodukte-benzin-diesel'!F143","v":25090},376.34999999999997,{"$f":"J150*Eingabe!$C$48","v":112.90499999999999},"topprodukte.at"]
[{"$f":"'topprodukte-benzin-diesel'!A144","v":"Renault"},{"$f":"'topprodukte-benzin-diesel'!B144","v":"Captur"},"Renault Captur - Diesel",{"$f":"'topprodukte-benzin-diesel'!O144","v":85},{"$f":"'topprodukte-benzin-diesel'!J144","v":"Diesel"},47.500550000000004,{"$f":"'topprodukte-benzin-diesel'!I144","v":4.7},{"$f":"'topprodukte-benzin-diesel'!K144","v":123},{"$f":"'topprodukte-benzin-diesel'!F144","v":24890},373.34999999999997,{"$f":"J151*Eingabe!$C$48","v":112.00499999999998},"topprodukte.at"]
[{"$f":"'topprodukte-benzin-diesel'!A145","v":"Seat"},{"$f":"'topprodukte-benzin-diesel'!B145","v":"Ibiza"},{"$f":"CONCATENATE(A152,\" \",B152,\" - \",E152)","v":"Seat Ibiza - Benzin"},{"$f":"'topprodukte-benzin-diesel'!O145","v":59},{"$f":"'topprodukte-benzin-diesel'!J145","v":"Benzin"},{"$f":"IF(E152=\"Benzin\",$O$3*G152,$O$4*G152)","v":46.116},{"$f":"'topprodukte-benzin-diesel'!I145","v":5.4},{"$f":"'topprodukte-benzin-diesel'!K145","v":122},{"$f":"'topprodukte-benzin-diesel'!F145","v":12990},{"$f":"IF(H152>$U$4,IF(I152*0.02>960,960,I152*0.02),IF(H152>0,IF(I152*0.015>720,720,I152*0.015),0))","v":194.85},{"$f":"J152*Eingabe!$C$48","v":58.454999999999998},"topprodukte.at"]
[{"$f":"'topprodukte-benzin-diesel'!A146","v":"Seat"},{"$f":"'topprodukte-benzin-diesel'!B146","v":"Leon"},"Seat Leon - Benzin",{"$f":"'topprodukte-benzin-diesel'!O146","v":81},{"$f":"'topprodukte-benzin-diesel'!J146","v":"Benzin"},46.116,{"$f":"'topprodukte-benzin-diesel'!I146","v":5.4},{"$f":"'topprodukte-benzin-diesel'!K146","v":122},{"$f":"'topprodukte-benzin-diesel'!F146","v":19990},299.84999999999997,{"$f":"J153*Eingabe!$C$48","v":89.954999999999984},"topprodukte.at"]
[{"$f":"'topprodukte-benzin-diesel'!A147","v":"Seat"},{"$f":"'topprodukte-benzin-diesel'!B147","v":"Arona"},"Seat Arona - Benzin",{"$f":"'topprodukte-benzin-diesel'!O147","v":70},{"$f":"'topprodukte-benzin-diesel'!J147","v":"Benzin"},47.823999999999991,{"$f":"'topprodukte-benzin-diesel'!I147","v":5.6},{"$f":"'topprodukte-benzin-diesel'!K147","v":128},{"$f":"'topprodukte-benzin-diesel'!F147","v":16690},250.35,{"$f":"J154*Eingabe!$C$48","v":75.10499999999999},"topprodukte.at"]
[{"$f":"'topprodukte-benzin-diesel'!A148","v":"Seat"},{"$f":"'topprodukte-benzin-diesel'!B148","v":"Ateca"},"Seat Ateca - Benzin",{"$f":"'topprodukte-benzin-diesel'!O148","v":85},{"$f":"'topprodukte-benzin-diesel'!J148","v":"Benzin"},55.509999999999991,{"$f":"'topprodukte-benzin-diesel'!I148","v":6.5},{"$f":"'topprodukte-benzin-diesel'!K148","v":146},{"$f":"'topprodukte-benzin-diesel'!F148","v":16690},333.8,{"$f":"J155*Eingabe!$C$48","v":100.14},"topprodukte.at"]
[{"$f":"'topprodukte-benzin-diesel'!A149","v":"Seat"},{"$f":"'topprodukte-benzin-diesel'!B149","v":"Alhambra"},"Seat Alhambra - Benzin",{"$f":"'topprodukte-benzin-diesel'!O149","v":110},{"$f":"'topprodukte-benzin-diesel'!J149","v":"Benzin"},55.509999999999991,{"$f":"'topprodukte-benzin-diesel'!I149","v":6.5},{"$f":"'topprodukte-benzin-diesel'!K149","v":150},{"$f":"'topprodukte-benzin-diesel'!F149","v":40130},802.6,{"$f":"J156*Eingabe!$C$48","v":240.78},"topprodukte.at"]
[{"$f":"'topprodukte-benzin-diesel'!A150","v":"Seat"},{"$f":"'topprodukte-benzin-diesel'!B150","v":"Arona"},"Seat Arona - Benzin",{"$f":"'topprodukte-benzin-diesel'!O150","v":70},{"$f":"'topprodukte-benzin-diesel'!J150","v":"Benzin"},40.991999999999997,{"$f":"'topprodukte-benzin-diesel'!I150","v":4.8},{"$f":"'topprodukte-benzin-diesel'!K150","v":125},{"$f":"'topprodukte-benzin-diesel'!F150","v":19990},299.84999999999997,{"$f":"J157*Eingabe!$C$48","v":89.954999999999984},"topprodukte.at"]
[{"$f":"'topprodukte-benzin-diesel'!A151","v":"Seat"},{"$f":"'topprodukte-benzin-diesel'!B151","v":"Ateca"},"Seat Ateca - Benzin",{"$f":"'topprodukte-benzin-diesel'!O151","v":85},{"$f":"'topprodukte-benzin-diesel'!J151","v":"Benzin"},42.699999999999996,{"$f":"'topprodukte-benzin-diesel'!I151","v":5},{"$f":"'topprodukte-benzin-diesel'!K151","v":139},{"$f":"'topprodukte-benzin-diesel'!F151","v":25880},517.6,{"$f":"J158*Eingabe!$C$48","v":155.28},"topprodukte.at"]
[{"$f":"'topprodukte-benzin-diesel'!A152","v":"Seat"},{"$f":"'topprodukte-benzin-diesel'!B152","v":"Arona"},"Seat Arona - Diesel",{"$f":"'topprodukte-benzin-diesel'!O152","v":70},{"$f":"'topprodukte-benzin-diesel'!J152","v":"Diesel"},48.511200000000002,{"$f":"'topprodukte-benzin-diesel'!I152","v":4.8},{"$f":"'topprodukte-benzin-diesel'!K152","v":125},{"$f":"'topprodukte-benzin-diesel'!F152","v":19990},299.84999999999997,{"$f":"J159*Eingabe!$C$48","v":89.954999999999984},"topprodukte.at"]
[{"$f":"'topprodukte-benzin-diesel'!A153","v":"Skoda"},{"$f":"'topprodukte-benzin-diesel'!B153","v":"Fabia"},"Skoda Fabia - Benzin",{"$f":"'topprodukte-benzin-diesel'!O153","v":70},{"$f":"'topprodukte-benzin-diesel'!J153","v":"Benzin"},46.116,{"$f":"'topprodukte-benzin-diesel'!I153","v":5.4},{"$f":"'topprodukte-benzin-diesel'!K153","v":123},{"$f":"'topprodukte-benzin-diesel'!F153","v":13240},198.6,{"$f":"J160*Eingabe!$C$48","v":59.58},"topprodukte.at"]
[{"$f":"'topprodukte-benzin-diesel'!A154","v":"Skoda"},{"$f":"'topprodukte-benzin-diesel'!B154","v":"Fabia Combi"},"Skoda Fabia Combi - Benzin",{"$f":"'topprodukte-benzin-diesel'!O154","v":70},{"$f":"'topprodukte-benzin-diesel'!J154","v":"Benzin"},45.261999999999993,{"$f":"'topprodukte-benzin-diesel'!I154","v":5.3},{"$f":"'topprodukte-benzin-diesel'!K154","v":119},{"$f":"'topprodukte-benzin-diesel'!F154","v":13590},203.85,{"$f":"J161*Eingabe!$C$48","v":61.154999999999994},"topprodukte.at"]
[{"$f":"'topprodukte-benzin-diesel'!A155","v":"Skoda"},{"$f":"'topprodukte-benzin-diesel'!B155","v":"Scala"},"Skoda Scala - Benzin",{"$f":"'topprodukte-benzin-diesel'!O155","v":70},{"$f":"'topprodukte-benzin-diesel'!J155","v":"Benzin"},46.97,{"$f":"'topprodukte-benzin-diesel'!I155","v":5.5},{"$f":"'topprodukte-benzin-diesel'!K155","v":126},{"$f":"'topprodukte-benzin-diesel'!F155","v":18980},284.7,{"$f":"J162*Eingabe!$C$48","v":85.41},"topprodukte.at"]
[{"$f":"'topprodukte-benzin-diesel'!A156","v":"Skoda"},{"$f":"'topprodukte-benzin-diesel'!B156","v":"Octavia Combi"},"Skoda Octavia Combi - Benzin",{"$f":"'topprodukte-benzin-diesel'!O156","v":84},{"$f":"'topprodukte-benzin-diesel'!J156","v":"Benzin"},45.261999999999993,{"$f":"'topprodukte-benzin-diesel'!I156","v":5.3},{"$f":"'topprodukte-benzin-diesel'!K156","v":120},{"$f":"'topprodukte-benzin-diesel'!F156","v":26880},403.2,{"$f":"J163*Eingabe!$C$48","v":120.96},"topprodukte.at"]
[{"$f":"'topprodukte-benzin-diesel'!A157","v":"Skoda"},{"$f":"'topprodukte-benzin-diesel'!B157","v":"Superb"},"Skoda Superb - Benzin",{"$f":"'topprodukte-benzin-diesel'!O157","v":110},{"$f":"'topprodukte-benzin-diesel'!J157","v":"Benzin"},52.947999999999993,{"$f":"'topprodukte-benzin-diesel'!I157","v":6.2},{"$f":"'topprodukte-benzin-diesel'!K157","v":141},{"$f":"'topprodukte-benzin-diesel'!F157","v":33840},676.80000000000007,{"$f":"J164*Eingabe!$C$48","v":203.04000000000002},"topprodukte.at"]
[{"$f":"'topprodukte-benzin-diesel'!A158","v":"Skoda"},{"$f":"'topprodukte-benzin-diesel'!B158","v":"Karoq"},"Skoda Karoq - Benzin",{"$f":"'topprodukte-benzin-diesel'!O158","v":85},{"$f":"'topprodukte-benzin-diesel'!J158","v":"Benzin"},53.801999999999992,{"$f":"'topprodukte-benzin-diesel'!I158","v":6.3},{"$f":"'topprodukte-benzin-diesel'!K158","v":142},{"$f":"'topprodukte-benzin-diesel'!F158","v":23980},479.6,{"$f":"J165*Eingabe!$C$48","v":143.88},"topprodukte.at"]
[{"$f":"'topprodukte-benzin-diesel'!A159","v":"Skoda"},{"$f":"'topprodukte-benzin-diesel'!B159","v":"Octavia Combi"},"Skoda Octavia Combi - Benzin",{"$f":"'topprodukte-benzin-diesel'!O159","v":85},{"$f":"'topprodukte-benzin-diesel'!J159","v":"Benzin"},37.576000000000001,{"$f":"'topprodukte-benzin-diesel'!I159","v":4.4000000000000004},{"$f":"'topprodukte-benzin-diesel'!K159","v":117},{"$f":"'topprodukte-benzin-diesel'!F159","v":29970},449.55,{"$f":"J166*Eingabe!$C$48","v":134.86500000000001},"topprodukte.at"]
[{"$f":"'topprodukte-benzin-diesel'!A160","v":"Skoda"},{"$f":"'topprodukte-benzin-diesel'!B160","v":"Kamiq"},"Skoda Kamiq - Benzin",{"$f":"'topprodukte-benzin-diesel'!O160","v":85},{"$f":"'topprodukte-benzin-diesel'!J160","v":"Benzin"},42.699999999999996,{"$f":"'topprodukte-benzin-diesel'!I160","v":5},{"$f":"'topprodukte-benzin-diesel'!K160","v":131},{"$f":"'topprodukte-benzin-diesel'!F160","v":24050},360.75,{"$f":"J167*Eingabe!$C$48","v":108.22499999999999},"topprodukte.at"]
[{"$f":"'topprodukte-benzin-diesel'!A161","v":"Skoda"},{"$f":"'topprodukte-benzin-diesel'!B161","v":"Octavia Combi"},"Skoda Octavia Combi - Diesel",{"$f":"'topprodukte-benzin-diesel'!O161","v":85},{"$f":"'topprodukte-benzin-diesel'!J161","v":"Diesel"},44.468600000000009,{"$f":"'topprodukte-benzin-diesel'!I161","v":4.4000000000000004},{"$f":"'topprodukte-benzin-diesel'!K161","v":117},{"$f":"'topprodukte-benzin-diesel'!F161","v":29970},449.55,{"$f":"J168*Eingabe!$C$48","v":134.86500000000001},"topprodukte.at"]
[{"$f":"'topprodukte-benzin-diesel'!A162","v":"Skoda"},{"$f":"'topprodukte-benzin-diesel'!B162","v":"Kamiq"},"Skoda Kamiq - Diesel",{"$f":"'topprodukte-benzin-diesel'!O162","v":85},{"$f":"'topprodukte-benzin-diesel'!J162","v":"Diesel"},50.532499999999999,{"$f":"'topprodukte-benzin-diesel'!I162","v":5},{"$f":"'topprodukte-benzin-diesel'!K162","v":131},{"$f":"'topprodukte-benzin-diesel'!F162","v":24050},360.75,{"$f":"J169*Eingabe!$C$48","v":108.22499999999999},"topprodukte.at"]
[{"$f":"'topprodukte-benzin-diesel'!A163","v":"Suzuki"},{"$f":"'topprodukte-benzin-diesel'!B163","v":"Swift"},"Suzuki Swift - Benzin",{"$f":"'topprodukte-benzin-diesel'!O163","v":66},{"$f":"'topprodukte-benzin-diesel'!J163","v":"Benzin"},43.553999999999995,{"$f":"'topprodukte-benzin-diesel'!I163","v":5.0999999999999996},{"$f":"'topprodukte-benzin-diesel'!K163","v":115},{"$f":"'topprodukte-benzin-diesel'!F163","v":13490},202.35,{"$f":"J170*Eingabe!$C$48","v":60.704999999999998},"topprodukte.at"]
[{"$f":"'topprodukte-benzin-diesel'!A164","v":"Suzuki"},{"$f":"'topprodukte-benzin-diesel'!B164","v":"Ignis"},"Suzuki Ignis - Benzin",{"$f":"'topprodukte-benzin-diesel'!O164","v":66},{"$f":"'topprodukte-benzin-diesel'!J164","v":"Benzin"},47.823999999999991,{"$f":"'topprodukte-benzin-diesel'!I164","v":5.6},{"$f":"'topprodukte-benzin-diesel'!K164","v":126},{"$f":"'topprodukte-benzin-diesel'!F164","v":16390},245.85,{"$f":"J171*Eingabe!$C$48","v":73.754999999999995},"topprodukte.at"]
[{"$f":"'topprodukte-benzin-diesel'!A165","v":"Suzuki"},{"$f":"'topprodukte-benzin-diesel'!B165","v":"Vitara"},"Suzuki Vitara - Benzin",{"$f":"'topprodukte-benzin-diesel'!O165","v":103},{"$f":"'topprodukte-benzin-diesel'!J165","v":"Benzin"},63.195999999999998,{"$f":"'topprodukte-benzin-diesel'!I165","v":7.4},{"$f":"'topprodukte-benzin-diesel'!K165","v":167},{"$f":"'topprodukte-benzin-diesel'!F165","v":26490},529.79999999999995,{"$f":"J172*Eingabe!$C$48","v":158.93999999999997},"topprodukte.at"]
[{"$f":"'topprodukte-benzin-diesel'!A166","v":"Toyota"},{"$f":"'topprodukte-benzin-diesel'!B166","v":"Aygo"},"Toyota Aygo - Benzin",{"$f":"'topprodukte-benzin-diesel'!O166","v":53},{"$f":"'topprodukte-benzin-diesel'!J166","v":"Benzin"},42.699999999999996,{"$f":"'topprodukte-benzin-diesel'!I166","v":5},{"$f":"'topprodukte-benzin-diesel'!K166","v":112},{"$f":"'topprodukte-benzin-diesel'!F166","v":11490},172.35,{"$f":"J173*Eingabe!$C$48","v":51.704999999999998},"topprodukte.at"]
[{"$f":"'topprodukte-benzin-diesel'!A167","v":"Toyota"},{"$f":"'topprodukte-benzin-diesel'!B167","v":"Yaris"},"Toyota Yaris - Benzin",{"$f":"'topprodukte-benzin-diesel'!O167","v":53},{"$f":"'topprodukte-benzin-diesel'!J167","v":"Benzin"},49.531999999999996,{"$f":"'topprodukte-benzin-diesel'!I167","v":5.8},{"$f":"'topprodukte-benzin-diesel'!K167","v":131},{"$f":"'topprodukte-benzin-diesel'!F167","v":13190},197.85,{"$f":"J174*Eingabe!$C$48","v":59.354999999999997},"topprodukte.at"]
[{"$f":"'topprodukte-benzin-diesel'!A168","v":"Toyota"},{"$f":"'topprodukte-benzin-diesel'!B168","v":"Corolla Kombi"},"Toyota Corolla Kombi - Benzin",{"$f":"'topprodukte-benzin-diesel'!O168","v":85},{"$f":"'topprodukte-benzin-diesel'!J168","v":"Benzin"},52.947999999999993,{"$f":"'topprodukte-benzin-diesel'!I168","v":6.2},{"$f":"'topprodukte-benzin-diesel'!K168","v":140},{"$f":"'topprodukte-benzin-diesel'!F168","v":22290},445.8,{"$f":"J175*Eingabe!$C$48","v":133.74},"topprodukte.at"]
[{"$f":"'topprodukte-benzin-diesel'!A169","v":"VW"},{"$f":"'topprodukte-benzin-diesel'!B169","v":"up!"},"VW up! - Benzin",{"$f":"'topprodukte-benzin-diesel'!O169","v":44},{"$f":"'topprodukte-benzin-diesel'!J169","v":"Benzin"},46.116,{"$f":"'topprodukte-benzin-diesel'!I169","v":5.4},{"$f":"'topprodukte-benzin-diesel'!K169","v":123},{"$f":"'topprodukte-benzin-diesel'!F169","v":12680},190.2,{"$f":"J176*Eingabe!$C$48","v":57.059999999999995},"topprodukte.at"]
[{"$f":"'topprodukte-benzin-diesel'!A170","v":"VW"},{"$f":"'topprodukte-benzin-diesel'!B170","v":"Polo"},"VW Polo - Benzin",{"$f":"'topprodukte-benzin-diesel'!O170","v":85},{"$f":"'topprodukte-benzin-diesel'!J170","v":"Benzin"},45.261999999999993,{"$f":"'topprodukte-benzin-diesel'!I170","v":5.3},{"$f":"'topprodukte-benzin-diesel'!K170","v":120},{"$f":"'topprodukte-benzin-diesel'!F170","v":15110},226.65,{"$f":"J177*Eingabe!$C$48","v":67.995000000000005},"topprodukte.at"]
[{"$f":"'topprodukte-benzin-diesel'!A171","v":"VW"},{"$f":"'topprodukte-benzin-diesel'!B171","v":"Golf"},"VW Golf - Benzin",{"$f":"'topprodukte-benzin-diesel'!O171","v":96},{"$f":"'topprodukte-benzin-diesel'!J171","v":"Benzin"},46.116,{"$f":"'topprodukte-benzin-diesel'!I171","v":5.4},{"$f":"'topprodukte-benzin-diesel'!K171","v":122},{"$f":"'topprodukte-benzin-diesel'!F171","v":26990},404.84999999999997,{"$f":"J178*Eingabe!$C$48","v":121.45499999999998},"topprodukte.at"]
[{"$f":"'topprodukte-benzin-diesel'!A172","v":"VW"},{"$f":"'topprodukte-benzin-diesel'!B172","v":"Golf Variant"},"VW Golf Variant - Benzin",{"$f":"'topprodukte-benzin-diesel'!O172","v":85},{"$f":"'topprodukte-benzin-diesel'!J172","v":"Benzin"},47.823999999999991,{"$f":"'topprodukte-benzin-diesel'!I172","v":5.6},{"$f":"'topprodukte-benzin-diesel'!K172","v":126},{"$f":"'topprodukte-benzin-diesel'!F172","v":25570},383.55,{"$f":"J179*Eingabe!$C$48","v":115.065},"topprodukte.at"]
[{"$f":"'topprodukte-benzin-diesel'!A173","v":"VW"},{"$f":"'topprodukte-benzin-diesel'!B173","v":"Passat"},"VW Passat - Benzin",{"$f":"'topprodukte-benzin-diesel'!O173","v":110},{"$f":"'topprodukte-benzin-diesel'!J173","v":"Benzin"},49.531999999999996,{"$f":"'topprodukte-benzin-diesel'!I173","v":5.8},{"$f":"'topprodukte-benzin-diesel'!K173","v":133},{"$f":"'topprodukte-benzin-diesel'!F173","v":32590},488.84999999999997,{"$f":"J180*Eingabe!$C$48","v":146.65499999999997},"topprodukte.at"]
[{"$f":"'topprodukte-benzin-diesel'!A174","v":"VW"},{"$f":"'topprodukte-benzin-diesel'!B174","v":"T-Cross"},"VW T-Cross - Benzin",{"$f":"'topprodukte-benzin-diesel'!O174","v":70},{"$f":"'topprodukte-benzin-diesel'!J174","v":"Benzin"},50.385999999999996,{"$f":"'topprodukte-benzin-diesel'!I174","v":5.9},{"$f":"'topprodukte-benzin-diesel'!K174","v":133},{"$f":"'topprodukte-benzin-diesel'!F174","v":19790},296.84999999999997,{"$f":"J181*Eingabe!$C$48","v":89.054999999999993},"topprodukte.at"]
[{"$f":"'topprodukte-benzin-diesel'!A175","v":"VW"},{"$f":"'topprodukte-benzin-diesel'!B175","v":"Golf Sportsvan"},"VW Golf Sportsvan - Benzin",{"$f":"'topprodukte-benzin-diesel'!O175","v":85},{"$f":"'topprodukte-benzin-diesel'!J175","v":"Benzin"},50.385999999999996,{"$f":"'topprodukte-benzin-diesel'!I175","v":5.9},{"$f":"'topprodukte-benzin-diesel'!K175","v":133},{"$f":"'topprodukte-benzin-diesel'!F175","v":27420},411.3,{"$f":"J182*Eingabe!$C$48","v":123.39},"topprodukte.at"]
[{"$f":"'topprodukte-benzin-diesel'!A176","v":"VW"},{"$f":"'topprodukte-benzin-diesel'!B176","v":"Golf"},"VW Golf - Benzin",{"$f":"'topprodukte-benzin-diesel'!O176","v":85},{"$f":"'topprodukte-benzin-diesel'!J176","v":"Benzin"},35.013999999999996,{"$f":"'topprodukte-benzin-diesel'!I176","v":4.0999999999999996},{"$f":"'topprodukte-benzin-diesel'!K176","v":107},{"$f":"'topprodukte-benzin-diesel'!F176","v":29390},440.84999999999997,{"$f":"J183*Eingabe!$C$48","v":132.255},"topprodukte.at"]
[{"$f":"'topprodukte-benzin-diesel'!A177","v":"VW"},{"$f":"'topprodukte-benzin-diesel'!B177","v":"Passat Limousine"},{"$f":"CONCATENATE(A184,\" \",B184,\" - \",E184)","v":"VW Passat Limousine - Benzin"},{"$f":"'topprodukte-benzin-diesel'!O177","v":110},{"$f":"'topprodukte-benzin-diesel'!J177","v":"Benzin"},{"$f":"IF(E184=\"Benzin\",$O$3*G184,$O$4*G184)","v":40.137999999999998},{"$f":"'topprodukte-benzin-diesel'!I177","v":4.7},{"$f":"'topprodukte-benzin-diesel'!K177","v":122},{"$f":"'topprodukte-benzin-diesel'!F177","v":36659},{"$f":"IF(H184>$U$4,IF(I184*0.02>960,960,I184*0.02),IF(H184>0,IF(I184*0.015>720,720,I184*0.015),0))","v":549.88499999999999},{"$f":"J184*Eingabe!$C$48","v":164.96549999999999},"topprodukte.at"]
[{"$f":"'topprodukte-benzin-diesel'!A178","v":"VW"},{"$f":"'topprodukte-benzin-diesel'!B178","v":"T-Roc"},{"$f":"CONCATENATE(A185,\" \",B185,\" - \",E185)","v":"VW T-Roc - Benzin"},{"$f":"'topprodukte-benzin-diesel'!O178","v":85},{"$f":"'topprodukte-benzin-diesel'!J178","v":"Benzin"},{"$f":"IF(E185=\"Benzin\",$O$3*G185,$O$4*G185)","v":44.407999999999994},{"$f":"'topprodukte-benzin-diesel'!I178","v":5.2},{"$f":"'topprodukte-benzin-diesel'!K178","v":136},{"$f":"'topprodukte-benzin-diesel'!F178","v":25770},{"$f":"IF(H185>$U$4,IF(I185*0.02>960,960,I185*0.02),IF(H185>0,IF(I185*0.015>720,720,I185*0.015),0))","v":386.55},{"$f":"J185*Eingabe!$C$48","v":115.965},"topprodukte.at"]
[{"$f":"'topprodukte-benzin-diesel'!A179","v":"VW"},{"$f":"'topprodukte-benzin-diesel'!B179","v":"Golf Sportsvan"},"VW Golf Sportsvan - Benzin",{"$f":"'topprodukte-benzin-diesel'!O179","v":85},{"$f":"'topprodukte-benzin-diesel'!J179","v":"Benzin"},44.407999999999994,{"$f":"'topprodukte-benzin-diesel'!I179","v":5.2},{"$f":"'topprodukte-benzin-diesel'!K179","v":136},{"$f":"'topprodukte-benzin-diesel'!F179","v":30120},451.8,{"$f":"J186*Eingabe!$C$48","v":135.54},"topprodukte.at"]
[{"$f":"'topprodukte-benzin-diesel'!A180","v":"VW"},{"$f":"'topprodukte-benzin-diesel'!B180","v":"Golf"},"VW Golf - Diesel",{"$f":"'topprodukte-benzin-diesel'!O180","v":85},{"$f":"'topprodukte-benzin-diesel'!J180","v":"Diesel"},41.43665,{"$f":"'topprodukte-benzin-diesel'!I180","v":4.0999999999999996},{"$f":"'topprodukte-benzin-diesel'!K180","v":107},{"$f":"'topprodukte-benzin-diesel'!F180","v":29390},440.84999999999997,{"$f":"J187*Eingabe!$C$48","v":132.255},"topprodukte.at"]
[{"$f":"'topprodukte-benzin-diesel'!A181","v":"VW"},{"$f":"'topprodukte-benzin-diesel'!B181","v":"Passat Limousine"},"VW Passat Limousine - Diesel",{"$f":"'topprodukte-benzin-diesel'!O181","v":110},{"$f":"'topprodukte-benzin-diesel'!J181","v":"Diesel"},47.500550000000004,{"$f":"'topprodukte-benzin-diesel'!I181","v":4.7},{"$f":"'topprodukte-benzin-diesel'!K181","v":122},{"$f":"'topprodukte-benzin-diesel'!F181","v":36659},549.88499999999999,{"$f":"J188*Eingabe!$C$48","v":164.96549999999999},"topprodukte.at"]
[{"$f":"'topprodukte-benzin-diesel'!A182","v":"VW"},{"$f":"'topprodukte-benzin-diesel'!B182","v":"T-Roc"},"VW T-Roc - Diesel",{"$f":"'topprodukte-benzin-diesel'!O182","v":85},{"$f":"'topprodukte-benzin-diesel'!J182","v":"Diesel"},52.553800000000003,{"$f":"'topprodukte-benzin-diesel'!I182","v":5.2},{"$f":"'topprodukte-benzin-diesel'!K182","v":136},{"$f":"'topprodukte-benzin-diesel'!F182","v":25770},386.55,{"$f":"J189*Eingabe!$C$48","v":115.965},"topprodukte.at"]
["Audi","Q3 35 TFSi","Audi Q3 35 TFSi - Benzin",110,"Benzin",{"$f":"IF(E190=\"Benzin\",$O$3*G190,$O$4*G190)","v":50.385999999999996},5.9,153,38720,774.4,{"$f":"J190*Eingabe!$C$48","v":232.32},"Link"]
["BMW","X3 xDrive20d","BMW X3 xDrive20d - Diesel",140,"Diesel",59.628350000000005,5.9,154,53500,960,{"$f":"J191*Eingabe!$C$48","v":288},"Link"]
["Ford","Edge","Ford Edge - Diesel",174,"Diesel",65.692250000000001,6.5,211,62400,960,{"$f":"J192*Eingabe!$C$48","v":288},"Link"]
["Honda","CR-V","Honda CR-V - Benzin",127,"Benzin",62.341999999999992,7.3,166,31290,625.80000000000007,{"$f":"J193*Eingabe!$C$48","v":187.74},"Link"]
["Hyundai","Tucson","Hyundai Tucson - Diesel",85,"Diesel",55.585750000000004,5.5,145,36790,735.80000000000007,{"$f":"J194*Eingabe!$C$48","v":220.74},"Link"]
["Hyundai","Tucson","Hyundai Tucson - Benzin",97,"Benzin",67.465999999999994,7.9,179,27290,545.79999999999995,{"$f":"J195*Eingabe!$C$48","v":163.73999999999998},"Link"]
["KIA","PLATIN","KIA PLATIN - Diesel",148,"Diesel",65.692250000000001,6.5,176,61990,960,{"$f":"J196*Eingabe!$C$48","v":288},"Link"]
["Mazda","CX-30","Mazda CX-30 - Diesel",85,"Diesel",51.543149999999997,5.0999999999999996,135,28490,427.34999999999997,{"$f":"J197*Eingabe!$C$48","v":128.20499999999998},"Link"]
["Seat","Tarraca","Seat Tarraca - Benzin",110,"Benzin",66.611999999999995,7.8,161,31990,639.80000000000007,{"$f":"J198*Eingabe!$C$48","v":191.94000000000003},"Link"]
["Seat","Tarraca","Seat Tarraca - Diesel",110,"Diesel",57.607050000000008,5.7,150,38240,764.80000000000007,{"$f":"J199*Eingabe!$C$48","v":229.44000000000003},"Link"]
["VW","Tiguan","VW Tiguan - Benzin",110,"Benzin",57.217999999999996,6.7,152,32680,653.6,{"$f":"J200*Eingabe!$C$48","v":196.08},"Link"]
["VW","Tiguan","VW Tiguan - Diesel",110,"Diesel",56.596399999999996,5.6,148,36870,737.4,{"$f":"J201*Eingabe!$C$48","v":221.22},"Link"]
["Audi","Q7","Audi Q7 - Diesel",170,"Diesel",68.724199999999996,6.8,218,74810,960,{"$f":"J202*Eingabe!$C$48","v":288},"Link"]
["Mini","Clubman Cooper","Mini Clubman Cooper - Benzin",100,"Benzin",53.801999999999992,6.3,143,27450,{"$f":"IF(H203>$U$4,IF(I203*0.02>960,960,I203*0.02),IF(H203>0,IF(I203*0.015>720,720,I203*0.015),0))","v":549},{"$f":"J203*Eingabe!$C$48","v":164.7},"Link"]
["Mini","Clubman Cooper","Mini Clubman Cooper - Diesel",110,"Diesel",{"$f":"IF(E204=\"Benzin\",$O$3*G204,$O$4*G204)","v":49.521850000000008},4.9000000000000004,128,29900,448.5,{"$f":"J204*Eingabe!$C$48","v":134.54999999999998},"Link"]
["MItsubishi","Outlander PHEV","MItsubishi Outlander PHEV - Benzin",99,"Benzin",17.079999999999998,2,46,39995,599.92499999999995,{"$f":"J205*Eingabe!$C$48","v":179.97749999999999},"Link"]
["Suzuki","Vitara","Suzuki Vitara - Benzin",103,"Benzin",52.093999999999994,6.1,139,26490,529.79999999999995,{"$f":"J206*Eingabe!$C$48","v":158.93999999999997},"Link"]
["Suzuki","SX4 S-Cross","Suzuki SX4 S-Cross - Benzin",103,"Benzin",50.385999999999996,5.9,135,25890,388.34999999999997,{"$f":"J207*Eingabe!$C$48","v":116.50499999999998},"Link"]
["Hyundai","IONIQ PHEV","Hyundai IONIQ PHEV - Benzin",104,"Benzin",9.3940000000000001,1.1000000000000001,26,32490,487.34999999999997,{"$f":"J208*Eingabe!$C$48","v":146.20499999999998},"Link"]
["BMW","X3 xDrive30e","BMW X3 xDrive30e - Benzin",215,"Benzin",16.225999999999999,1.9,44,59450,720,{"$f":"J209*Eingabe!$C$48","v":216},"Link"]
["Volvo","XC60 B4","Volvo XC60 B4 - Benzin",145,"Benzin",64.05,7.5,169,48555,960,{"$f":"J210*Eingabe!$C$48","v":288},"Link"]
["Volvo","XC60 B4 AWD","Volvo XC60 B4 AWD - Diesel",145,"Diesel",60.639000000000003,6,161,53122,960,{"$f":"J211*Eingabe!$C$48","v":288},"Link"]
["Eingabe","eigenes Fahrzeug","Eingabe eigenes Fahrzeug - ",null,null,0,null,null,null,0,{"$f":"J212*Eingabe!$C$48","v":0}]
["Eingabe","eigenes Fahrzeug","Eingabe eigenes Fahrzeug - ",null,null,0,null,null,null,0,{"$f":"J213*Eingabe!$C$48","v":0}]
["Eingabe","eigenes Fahrzeug","Eingabe eigenes Fahrzeug - ",null,null,0,null,null,null,0,{"$f":"J214*Eingabe!$C$48","v":0}]
["Eingabe","eigenes Fahrzeug","Eingabe eigenes Fahrzeug - ",null,null,0,null,null,null,0,{"$f":"J215*Eingabe!$C$48","v":0}]
["Eingabe","eigenes Fahrzeug",{"$f":"CONCATENATE(A216,\" \",B216,\" - \",E216)","v":"Eingabe eigenes Fahrzeug - "},null,null,0,null,null,null,0,{"$f":"J216*Eingabe!$C$48","v":0}]
["Eingabe","eigenes Fahrzeug","Eingabe eigenes Fahrzeug - ",null,null,0,null,null,null,0,{"$f":"J217*Eingabe!$C$48","v":0}]
["Eingabe","eigenes Fahrzeug","Eingabe eigenes Fahrzeug - ",null,null,0,null,null,null,0,{"$f":"J218*Eingabe!$C$48","v":0}]
["Eingabe","eigenes Fahrzeug","Eingabe eigenes Fahrzeug - ",null,null,0,null,null,null,0,{"$f":"J219*Eingabe!$C$48","v":0}]
["Eingabe","eigenes Fahrzeug","Eingabe eigenes Fahrzeug - ",null,null,0,null,null,null,0,{"$f":"J220*Eingabe!$C$48","v":0}]
["Eingabe","eigenes Fahrzeug","Eingabe eigenes Fahrzeug - ",null,null,0,null,null,null,0,{"$f":"J221*Eingabe!$C$48","v":0}]
["Eingabe","eigenes Fahrzeug","Eingabe eigenes Fahrzeug - ",null,null,0,null,null,null,0,{"$f":"J222*Eingabe!$C$48","v":0}]
["Eingabe","eigenes Fahrzeug","Eingabe eigenes Fahrzeug - ",null,null,0,null,null,null,0,{"$f":"J223*Eingabe!$C$48","v":0}]
["Eingabe","eigenes Fahrzeug","Eingabe eigenes Fahrzeug - ",null,null,0,null,null,null,0,{"$f":"J224*Eingabe!$C$48","v":0}]
["Eingabe","eigenes Fahrzeug","Eingabe eigenes Fahrzeug - ",null,null,0,null,null,null,0,{"$f":"J225*Eingabe!$C$48","v":0}]
["Eingabe","eigenes Fahrzeug","Eingabe eigenes Fahrzeug - ",null,null,0,null,null,null,0,{"$f":"J226*Eingabe!$C$48","v":0}]
["Eingabe","eigenes Fahrzeug","Eingabe eigenes Fahrzeug - ",null,null,0,null,null,null,0,{"$f":"J227*Eingabe!$C$48","v":0}]
["Eingabe","eigenes Fahrzeug","Eingabe eigenes Fahrzeug - ",null,null,0,null,null,null,0,{"$f":"J228*Eingabe!$C$48","v":0}]
["Eingabe","eigenes Fahrzeug","Eingabe eigenes Fahrzeug - ",null,null,0,null,null,null,0,{"$f":"J229*Eingabe!$C$48","v":0}]
["Eingabe","eigenes Fahrzeug","Eingabe eigenes Fahrzeug - ",null,null,0,null,null,null,0,{"$f":"J230*Eingabe!$C$48","v":0}]
["Eingabe","eigenes Fahrzeug","Eingabe eigenes Fahrzeug - ",null,null,0,null,null,null,0,{"$f":"J231*Eingabe!$C$48","v":0}]
["Eingabe","eigenes Fahrzeug","Eingabe eigenes Fahrzeug - ",null,null,0,null,null,null,0,{"$f":"J232*Eingabe!$C$48","v":0}]
["Eingabe","eigenes Fahrzeug","Eingabe eigenes Fahrzeug - ",null,null,0,null,null,null,0,{"$f":"J233*Eingabe!$C$48","v":0}]
["Eingabe","eigenes Fahrzeug","Eingabe eigenes Fahrzeug - ",null,null,0,null,null,null,0,{"$f":"J234*Eingabe!$C$48","v":0}]
["Eingabe","eigenes Fahrzeug","Eingabe eigenes Fahrzeug - ",null,null,{"$f":"IF(E235=\"Benzin\",$O$3*G235,$O$4*G235)","v":0},null,null,null,0,{"$f":"J235*Eingabe!$C$48","v":0}]
["Eingabe","eigenes Fahrzeug","Eingabe eigenes Fahrzeug - ",null,null,0,null,null,null,0,{"$f":"J236*Eingabe!$C$48","v":0}]
["Eingabe","eigenes Fahrzeug","Eingabe eigenes Fahrzeug - ",null,null,0,null,null,null,0,{"$f":"J237*Eingabe!$C$48","v":0}]
["Eingabe","eigenes Fahrzeug","Eingabe eigenes Fahrzeug - ",null,null,0,null,null,null,0,{"$f":"J238*Eingabe!$C$48","v":0}]
["Eingabe","eigenes Fahrzeug","Eingabe eigenes Fahrzeug - ",null,null,0,null,null,null,0,{"$f":"J239*Eingabe!$C$48","v":0}]
["Eingabe","eigenes Fahrzeug","Eingabe eigenes Fahrzeug - ",null,null,0,null,null,null,0,{"$f":"J240*Eingabe!$C$48","v":0}]
["Eingabe","eigenes Fahrzeug","Eingabe eigenes Fahrzeug - ",null,null,0,null,null,null,0,{"$f":"J241*Eingabe!$C$48","v":0}]
["Eingabe","eigenes Fahrzeug","Eingabe eigenes Fahrzeug - ",null,null,0,null,null,null,0,{"$f":"J242*Eingabe!$C$48","v":0}]
["Eingabe","eigenes Fahrzeug","Eingabe eigenes Fahrzeug - ",null,null,0,null,null,null,0,{"$f":"J243*Eingabe!$C$48","v":0}]
["Eingabe","eigenes Fahrzeug","Eingabe eigenes Fahrzeug - ",null,null,0,null,null,null,{"$f":"IF(H244>$U$4,IF(I244*0.02>960,960,I244*0.02),IF(H244>0,IF(I244*0.015>720,720,I244*0.015),0))","v":0},{"$f":"J244*Eingabe!$C$48","v":0}]
["Eingabe","eigenes Fahrzeug","Eingabe eigenes Fahrzeug - ",null,null,0,null,null,null,0,{"$f":"J245*Eingabe!$C$48","v":0}]
["Eingabe","eigenes Fahrzeug","Eingabe eigenes Fahrzeug - ",null,null,0,null,null,null,0,{"$f":"J246*Eingabe!$C$48","v":0}]
["Eingabe","eigenes Fahrzeug","Eingabe eigenes Fahrzeug - ",null,null,0,null,null,null,0,{"$f":"J247*Eingabe!$C$48","v":0}]
["Eingabe","eigenes Fahrzeug","Eingabe eigenes Fahrzeug - ",null,null,0,null,null,null,0,{"$f":"J248*Eingabe!$C$48","v":0}]
["Eingabe","eigenes Fahrzeug","Eingabe eigenes Fahrzeug - ",null,null,0,null,null,null,0,{"$f":"J249*Eingabe!$C$48","v":0}]
["Eingabe","eigenes Fahrzeug","Eingabe eigenes Fahrzeug - ",null,null,0,null,null,null,0,{"$f":"J250*Eingabe!$C$48","v":0}]
["Eingabe","eigenes Fahrzeug","Eingabe eigenes Fahrzeug - ",null,null,0,null,null,null,0,{"$f":"J251*Eingabe!$C$48","v":0}]
["Eingabe","eigenes Fahrzeug","Eingabe eigenes Fahrzeug - ",null,null,0,null,null,null,0,{"$f":"J252*Eingabe!$C$48","v":0}]
["Eingabe","eigenes Fahrzeug","Eingabe eigenes Fahrzeug - ",null,null,0,null,null,null,0,{"$f":"J253*Eingabe!$C$48","v":0}]
[]
[]
[]
[]
[]
[]
[]
[]
[]
[]
[]
[]
[]
[]
[]
[]
[]
[]
[]
[]
[]
[null,null,null,null,null,null,null,null,null,null,null,null,"Citroen"]
[null,null,null,null,null,null,null,null,null,null,null,null,"C1 "]
[]
[null,null,null,null,null,null,null,null,null,null,null,null,"VTI 68 "]
[]
[null,null,null,null,null,null,null,null,null,null,null,null,null,"Toyota"]
[null,null,null,null,null,null,null,null,null,null,null,null,8990,"Aygo"]
[null,null,null,null,null,null,null,null,null,null,null,null,null,null,"Skoda","Renault"]
[null,null,null,null,null,null,null,null,null,null,null,null,null,"1.0 VVT-i","Citigo","Twingo"]
[null,null,null,null,null,null,null,null,null,null,null,null,4.0999999999999996,null,null,null,"smart","Audi","Fiat","Opel","Lancia","Suzuki","Ford","Nissan","Citroen","Peugeot","Kia","Mini","Hyundai ","Honda","Skoda","Mini","Ineffizientes Gerät"]
[null,null,null,null,null,null,null,null,null,null,null,null,null,null,"1.0l MPI","SCe 70","forfour","A1","Panda City Car","Adam JAM","Ypsilon","Swift 5-Türer","Fiesta Trend","Micra Acenta ","C3","208 3-Türer","Picanto 3-Türer","3-Türer","i10","Jazz MY16","Fabia","5-Türer","Marke und"]
[null,null,null,null,null,null,null,null,null,null,null,null,95,9990,null,"Stop&Start",null,null,null,null,null,null,null,null,null,null,null,null,null,null,null,null,"Modell anonymisiert"]
[null,null,null,null,null,null,null,null,null,null,null,null,null,null,null,null,"52 kW mit","1.0 TFSI ultra","0.9 TwinAir","1.0 Turbo EcoFelx","0.9 8V TwinIR ","1.2 Dualjet","1.0 Auto","1.2 l DIG-S","PureTech 68","1.2 PureTech 82","1.0 MPI ISG","Cooper","blue 1.0","1.3 TREND","1.0 l MPI ","Cooper","k.A."]
[null,null,null,null,null,null,null,null,null,null,null,null,6,null,9920,11590,"Start-Stop","15'-16'","Start&Stop","Direct injection",null,null,"Start/Stop-System",null,null,"ASG5"]
[null,null,null,null,null,null,null,null,null,null,null,null,5,4.0999999999999996,null,null,"Automatik",null,null,"66 kW",null,null,"48 kW"]
[null,null,null,null,null,null,null,null,null,null,null,null,51,null,null,null,11710,17960,14290,16400,16750,14990,15137,15700,11990,16100,10890,20800,10390,17420,11760,20800,"k.A."]
[null,null,null,null,null,null,null,null,null,null,null,null,null,95,4.2,4.2]
[null,null,null,null,null,null,null,null,null,null,null,null,69]
[null,null,null,null,null,null,null,null,null,null,null,null,null,6,95,95,4.2,4.2,4.2,4.2,4.2,4.3,4.3,4.3,4.4000000000000004,4.4000000000000004,4.4000000000000004,4.5,4.5999999999999996,4.5999999999999996,4.7,4.7,6]
[null,null,null,null,null,null,null,null,null,null,null,null,"M5",4]
[null,null,null,null,null,null,null,null,null,null,null,null,3466,51,6,6,97,97,99,99,99,99,99,99,102,102,102,105,106,106,106,109,139]
[null,null,null,null,null,null,null,null,null,null,null,null,1884,null,4,4]
[null,null,null,null,null,null,null,null,null,null,null,null,1460,69,44,52,6,6,6,6,6,6,6,6,6,6,6,6,6,6,6,6,6]
[null,null,null,null,null,null,null,null,null,null,null,null,null,null,null,null,4,5,4,4,5,5,5,5,5,5,5,4,5,5,5,5,5]
[null,null,null,null,null,null,null,null,null,null,null,null,null,"M5",60,71,52,60,63,66,63,66,48,72,60,50,48,100,49,75,44,100,141]
[null,null,null,null,null,null,null,null,null,null,null,null,null,3455]
[null,null,null,null,null,null,null,null,null,null,null,null,null,1968,"M5","M5",71,82,86,90,86,90,65,98,82,68,65,136,67,102,60,136,192]
[null,null,null,null,null,null,null,null,null,null,null,null,null,1460,3563,3595]
[null,null,null,null,null,null,null,null,null,null,null,null,null,null,1910,"k.A.","M5","M5","A5","M6","M5","M5","M5","M5","M5","AMT5","M5","M6","M5","CVT","M5","M6","M6"]
[null,null,null,null,null,null,null,null,null,null,null,null,"Feel, Shine, Start ",null,1463,1554,3495,3973,3653,3698,3842,3850,3969,3825,3941,3962,3595,3821,3665,3995,3992,3982,"k.A."]
[null,null,null,null,null,null,null,null,null,"Opel","VW",null,null,null,"1.0l (4.2, 98, 55, 75)",null,1752,1906,1882,1966,"x",1950,1978,1937,1994,2004,1875,1932,1905,1980,1958,1932,"k.A."]
[null,null,"Suzuki","Peugeot ","Fiat","MItsubishi","smart","Suzuki","VW","Karl","up!",null,"auch als 5 -Türer ",null,null,null,1554,1416,1551,1484,1518,1535,1495,1520,1524,1460,1480,1414,1500,1525,1452,1425,"k.A."]
["nach diesem Kriterium sortieren","Modell","Celerio 5-Türer","108 3-Türer","500 Lounge","Space Star Inform","fortwo","Baleno","Polo",null,null,null,null,null,null,null,null,"1.0 TFSI ultra",null,"1.0 Turbo EcoFelx",null,null,"1.0 Eco Boost Auto",null,"PureTech 68","1.0 PureTech 82","1.2 MPI","One",null,null,"1.0 MPI","One"]
[null,null,null,null,null,null,null,null,null,"1.0 EcoTEC","1.0 BlueMotion",null,null,null,null,null,null,"15'-16'",null,"Direct injection",null,null,"Start/Stop-System",null,"(4.3, 99, 50, 68)","(4.5, 104, 60, 82)","(4.6, 106, 62, 85)","(4.6, 108, 75, 102)",null,null,"(4.8, 108, 55, 75)","(4.8,112,75,102)"]
["nach diesem Kriterium sortieren","Motor","1.0 Dualjet","e-Vit 68","0.9 8V TA","1,0 MIVEC AS&G","52 kW mit","1.2 Dualjet SHVS","1.0 TSI BlueMotion","Start Stop","Technology",null,null,null,null,null,null,"(4.2, 97,70, 95)",null,"85 kW",null,null,"(4.3, 99, 92, 125)",null,"PureTech 110 S&S","Pure Tech 110 S&S",null,null,null,null,"1.2 TSI"]
[null,null,null,null,"Start&Stop ",null,"Start-Stop-Automatik",null,null,null,null,null,null,null,null,null,null,null,null,"(5.0,112,85,115)",null,null,null,null,"(4.5, 104, 81, 110)","(4.5, 103, 81, 110)",null,null,null,null,"(4.7, 107, 66, 90)"]
[null,null,null,null,null,null,null,null,null,10580,114540,null,"nach diesem Kriterium sortieren","Als 3-Türer oder","Active,","Zen, Intens",null,null,null,null,null,null,null,null,null,null,null,null,null,null,"1.2 TSI"]
["nach diesem Kriterium sortieren","Kaufpreis bei",12190,11490,16650,11490,11010,18490,18090,null,null,null,"CO2-Emissionen","5-Türer erhältlich","Style, ",null,null,null,null,null,null,null,null,null,null,null,null,null,null,null,"(4.8, 110, 81, 110)"]
[null,"Grundausstattung",null,null,null,null,null,null,null,null,null,null,84,null,null,null,null,"Sportback, sport,","Pop, Easy","Glam, Slam",null,"flash,",null,"N-TEC","Seductio, Attraction","Active, Allure","Silber","One, Cooper","Life, Comfort","Trend, Comfort","Joy,","One, Cooper"]
[null,"[ab EUR] inkl MWSt.",null,null,null,null,null,null,null,4.0999999999999996,4.0999999999999996,null,88,null,null,null,null,"design","Lounge",null,null,"shine",null,"Supermouse, Acenta","Exclusive",null,null,null,null,"Elegance","Monte Carlo "]
["nach diesem Kriterium sortieren","Kraftstoffver-",3.6,3.8,3.8,4,4.0999999999999996,4,4.0999999999999996,null,null,null,90,null,null,null,null,null,null,null,"auch als Automatik","Als 3-Türer oder","Als 3-Türer oder",null,"Auch als DS3","Als 3-Türer oder","Als 3-Türer oder",null,null,null,"Auch als Combi"]
[null,"brauch [l/100km]",null,null,null,null,null,null,null,94,95,null,92,null,null,null,null,null,null,null,"sehr gute Werte","5-Türer erhältlich","5-Türer erhältlich",null,"erhältlich","5-Türer erhältlich","5-Türer erhältlich",null,null,null,"erhältlich "]
["nach diesem Kriterium sortieren","CO2-Emissionen",84,88,90,92,93,94,94,null,null,null,93,"[g/km]"]
[null,"[g/km]",null,null,null,null,null,null,null,6,6,null,94,null,"nach diesem Kriterium sortieren","nach diesem Kriterium sortieren"]
["nach diesem Kriterium sortieren","EU-Abgasnorm",6,6,6,6,6,6,6,5,4,null,101,null,"EU-Abgasnorm","Sitzplätze"]
["nach diesem Kriterium sortieren","Sitzplätze",5,4,4,5,2,5,5,55,44,null,94,null,6,5,"nach diesem Kriterium sortieren",null,"nach diesem Kriterium sortieren",null,"nach diesem Kriterium sortieren","nach diesem Kriterium sortieren","nach diesem Kriterium sortieren","nach diesem Kriterium sortieren","nach diesem Kriterium sortieren",null,null,null,null,null,"nach diesem Kriterium sortieren",null,"Anmerkung"]
["nach diesem Kriterium sortieren","Leistung",50,51,63,52,52,66,70,null,null,null,95,null,6,4,"Leistung","[kW]","Leistung","[PS]","Getriebe","Länge [mm]","Breite mit Außenspiegel [mm]","Höhe ohne Dachreeling [mm]","andere Motoren","(Verbrauch, CO2-Emission,","Leistung [kW], Leistung [PS])",null,null,null,"Modellvarianten"]
[null,"[kW]",null,null,null,null,null,null,null,75,60,null,95,null,6,4,50,null,68,null,"M5",3600,1950,1530,null,null,null,null,null,null,"pure, clear","shine"]
["nach diesem Kriterium sortieren","Leistung",68,69,85.68,71,71,90,95,null,null,null,95,null,6,5,51,null,69,null,"M5",3470,2004,1450,null,null,null,null,null,null,"Active, Allure",null,"Als 3-Türer oder","5-Türer erhältlich"]
[null,"[PS]",null,null,null,null,null,null,null,"M5","M5",null,95,null,6,2,63,null,85.68,null,"M5",3546,1882,1488,"1.2 8V","S&S Dualogic","(4.5, 105, 51, 69)",null,null,null,"500C"]
["nach diesem Kriterium sortieren","Getriebe","M5","M5","M5","M5","M5","M5","M6",3675,3540,null,95,null,6,5,52,null,71,null,"M5",3710,"k.A.",1505,"1.2 MIVEC AS&G","(4.3, 100, 59, 80)",null,null,null,null,"Comfort Line,","Intense"]
["nach diesem Kriterium sortieren","Länge [mm]",3600,3470,3546,3710,2695,3995,3972,1876,1910,null,97,null,6,5,52,null,71,null,"M5",2695,1752,1555,null,null,null,null,null,null,null,null,"Höhe entspricht","Microvan-Kriterien"]
["nach diesem Kriterium sortieren","Breite mit Außenspiegel [mm]",1950,2004,1882,"k.A.",1752,"k.A.",1901,1476,1489,null,97,null,6,5,66,null,90,null,"M5",3995,"k.A.",1470]
["nach diesem Kriterium sortieren","Höhe ohne Dachreeling [mm]",1530,1450,1488,1505,1555,1470,1453,null,"1.0 BlueMotion",null,99,null,6,4,70,null,95,null,"M6",3972,1901,1453,"1.0 TSI","(4.3, 99, 81, 110),","1.2 TSI","(4.7, 107, 66, 90)",null,null,"BlueMotion, Austria","Comfortline, Highline"]
["nach diesem Kriterium sortieren","andere Motoren",null,null,"1.2 8V","1.2 MIVEC AS&G",null,null,"1.0 TSI",null,"(4.2, 98, 55, 75)",null,99,null,6,5,55,null,75,null,"M5",3675,1876,1476,null,null,null,null,null,null,"Edition,","Österreich Edition","Als 3-Türer oder","5-Türer erhältlich","4/5 Sitzer"]
[null,"(Verbrauch, CO2-Emission,",null,null,"S&S Dualogic","(4.3, 100, 59, 80)",null,null,"(4.3, 99, 81, 110),",null,null,null,99,null,6,4,44,null,60,null,"M5",3540,1910,1489,"1.0 BlueMotion","(4.2, 98, 55, 75)",null,null,null,null,"move up!, club up!,","high up!"]
[null,"Leistung [kW], Leistung [PS])",null,null,"(4.5, 105, 51, 69)",null,null,null,"1.2 TSI",null,null,null,99,null,6,4,51,null,69,null,"M5",3466,1884,1460,null,null,null,null,null,null,"Feel, Shine, Start ",null,"auch als 5 -Türer "]
[null,null,null,null,null,null,null,null,"(4.7, 107, 66, 90)",null,null,null,99,null,6,4,51,null,69,null,"M5",3455,1968,1460,null,null,null,null,null,null,null,null,"Als 3-Türer oder","5-Türer erhältlich"]
[null,null,null,null,null,null,null,null,null,null,null,null,99,null,6,4,44,null,60,null,"M5",3563,1910,1463,"1.0l (4.2, 98, 55, 75)",null,null,null,null,null,"Active,","Style, "]
[null,null,null,null,null,null,null,null,null,"Edition,","move up!, club up!,",null,102,null,6,5,52,null,71,null,"M5",3595,"k.A.",1554,null,null,null,null,null,null,"Zen, Intens"]
["nach diesem Kriterium sortieren","Modellvarianten","pure, clear","Active, Allure","500C","Comfort Line,",null,null,"BlueMotion, Austria","Österreich Edition","high up!",null,102,null,6,4,52,null,71,null,"M5",3495,1752,1554]
[null,null,"shine",null,null,"Intense",null,null,"Comfortline, Highline","Als 3-Türer oder",null,null,102,null,6,4,60,null,82,null,"M5",3973,1906,1416,"1.0 TFSI ultra","15'-16'","(4.2, 97,70, 95)",null,null,null,"Sportback, sport,","design"]
["Anmerkung",null,null,"Als 3-Türer oder",null,null,"Höhe entspricht",null,null,"5-Türer erhältlich",null,null,105,null,6,5,63,null,86,null,"A5",3653,1882,1551,null,null,null,null,null,null,"Pop, Easy","Lounge"]
[null,null,null,"5-Türer erhältlich",null,null,"Microvan-Kriterien",null,null,"4/5 Sitzer",null,null,106,null,6,5,66,null,90,null,"M6",3698,1966,1484,"1.0 Turbo EcoFelx","Direct injection","85 kW","(5.0,112,85,115)",null,null,"Glam, Slam"]
[null,null,null,null,null,null,null,null,null,null,null,null,106,null,6,5,63,null,86,null,"M5",3842,"x",1518,null,null,null,null,null,null,null,null,"auch als Automatik","sehr gute Werte"]
[null,null,null,null,null,null,null,null,null,null,null,null,106,null,6,5,66,null,90,null,"M5",3850,1950,1535,null,null,null,null,null,null,"flash,","shine","Als 3-Türer oder","5-Türer erhältlich"]
[null,null,null,null,null,null,null,null,null,"nach diesem Kriterium sortieren",null,null,109,null,6,5,48,null,65,null,"M5",3969,1978,1495,"1.0 Eco Boost Auto","Start/Stop-System","(4.3, 99, 92, 125)",null,null,null,null,null,"Als 3-Türer oder","5-Türer erhältlich"]
[null,"nach diesem Kriterium sortieren",null,"nach diesem Kriterium sortieren",null,null,"nach diesem Kriterium sortieren",null,null,"Kraftstoffver-","brauch [l/100km]",null,139,null,6,5,72,null,98,null,"M5",3825,1937,1520,null,null,null,null,null,null,"N-TEC","Supermouse, Acenta"]
[null,"Modell",null,"Motor",null,null,"Kaufpreis bei","Grundausstattung","[ab EUR] inkl MWSt.",3.6,null,null,null,null,6,5,60,null,82,null,"M5",3941,1994,1524,"PureTech 68","(4.3, 99, 50, 68)","PureTech 110 S&S","(4.5, 104, 81, 110)",null,null,"Seductio, Attraction","Exclusive","Auch als DS3","erhältlich"]
["Suzuki","Celerio 5-Türer",null,"1.0 Dualjet",null,null,12190,null,null,3.8,null,null,null,null,6,4,50,null,68,null,"AMT5",3962,2004,1460,"1.0 PureTech 82","(4.5, 104, 60, 82)","Pure Tech 110 S&S","(4.5, 103, 81, 110)",null,null,"Active, Allure",null,"Als 3-Türer oder","5-Türer erhältlich"]
["Peugeot ","108 3-Türer",null,"e-Vit 68",null,null,11490,null,null,3.8,null,null,null,null,6,5,48,null,65,null,"M5",3595,1875,1480,"1.2 MPI","(4.6, 106, 62, 85)",null,null,null,null,"Silber",null,"Als 3-Türer oder","5-Türer erhältlich"]
["Fiat","500 Lounge",null,"0.9 8V TA","Start&Stop ",null,16650,null,null,4,null,null,null,null,6,5,100,null,136,null,"M6",3821,1932,1414,"One","(4.6, 108, 75, 102)",null,null,null,null,"One, Cooper"]
["MItsubishi","Space Star Inform",null,"1,0 MIVEC AS&G",null,null,11490,null,null,4.0999999999999996,null,null,null,null,6,5,49,null,67,null,"M5",3665,1905,1500,null,null,null,null,null,null,"Life, Comfort"]
["smart","fortwo",null,"52 kW mit","Start-Stop-Automatik",null,11010,null,null,4,null,null,null,null,6,5,75,null,102,null,"CVT",3995,1980,1525,null,null,null,null,null,null,"Trend, Comfort","Elegance"]
["Suzuki","Baleno",null,"1.2 Dualjet SHVS",null,null,18490,null,null,4.4000000000000004,null,null,null,null,6,5,44,null,60,null,"M5",3992,1958,1452,"1.0 MPI","(4.8, 108, 55, 75)","1.2 TSI","(4.7, 107, 66, 90)","1.2 TSI","(4.8, 110, 81, 110)","Joy,","Monte Carlo ","Auch als Combi","erhältlich "]
["VW","Polo",null,"1.0 TSI BlueMotion",null,null,18090,null,null,4.0999999999999996,null,null,null,null,null,null,100,null,136,null,"M6",3982,1932,1425,"One","(4.8,112,75,102)",null,null,null,null,"One, Cooper"]
["Opel","Karl",null,"1.0 EcoTEC","Start Stop",null,10580,null,null,4.0999999999999996,null,null,null,null,null,null,141,null,192,null,"M6","k.A.","k.A.","k.A."]
["VW","up!",null,"1.0 BlueMotion","Technology",null,11450,null,null,4.0999999999999996]
["Citroen","C1 ",null,"VTI 68 ",null,null,8990,null,null,4.0999999999999996]
["Toyota","Aygo",null,"1.0 VVT-i",null,null,9990,null,null,4.2]
["Skoda","Citigo",null,"1.0l MPI",null,null,9920,null,null,4.2]
["Renault","Twingo",null,"SCe 70","Stop&Start",null,11590,null,null,4.2]
["smart","forfour",null,"52 kW mit","Start-Stop","Automatik",11710,null,null,4.2]
["Audi","A1",null,"1.0 TFSI ultra","15'-16'",null,17870,null,null,4.2,null,null,"VW","Ford"]
["Fiat","Panda City Car",null,"0.9 TwinAir","Start&Stop",null,14290,null,null,4.2,null,null,"T-Roc","Tourneo Courier"]
["Opel","Adam JAM",null,"1.0 Turbo EcoFelx","Direct injection","66 kW",16400,null,null,4.2,null,null,"1,6 TDI","1.5 TDCi S&S"]
["Lancia","Ypsilon",null,"0.9 8V TwinIR ",null,null,16750,null,null,4.3]
["Suzuki","Swift 5-Türer",null,"1.2 Dualjet",null,null,14990,null,null,4.3,null,null,"25 770","18 142"]
["Ford","Fiesta Trend",null,"1.0 Auto","Start/Stop-System","48 kW",15700,null,null,4.3]
["Nissan","Micra Acenta ",null,"1.2 l DIG-S",null,null,15137,null,null,4.4000000000000004]
["Citroen","C3",null,"PureTech 68",null,null,11990,null,null,4.4000000000000004,null,null,5.2,5.4]
["Peugeot","208 3-Türer",null,"1.2 PureTech 82","ASG5",null,16100,null,null,4.4000000000000004]
["Kia","Picanto 3-Türer",null,"1.0 MPI ISG",null,null,10890,null,null,4.5,null,null,136,141]
["Mini","3-Türer",null,"Cooper",null,null,20800,null,null,4.5999999999999996]
["Hyundai ","i10",null,"blue 1.0",null,null,10390,null,null,4.5999999999999996,null,null,"6d-TEMP-EVAP-ISC","6d-TEMP-EVAP-ISC"]
["Honda","Jazz MY16",null,"1.3 TREND",null,null,17420,null,null,4.7,null,null,5,5]
["Skoda","Fabia",null,"1.0 l MPI ",null,null,11760,null,null,4.7,null,null,85,55]
["Mini","5-Türer",null,"Cooper",null,null,20800,null,null,6]
["Ineffizientes Gerät","Marke und","Modell anonymisiert","k.A.",null,null,"k.A.",null,null,null,null,null,115,75]
[]
[null,null,null,null,null,null,null,null,null,null,null,null,"M6","M6"]
[null,null,null,null,null,null,null,null,null,null,null,null,"4 234","4 157"]
[null,null,null,null,null,null,null,null,null,null,null,null,"1 992","2 112"]
[null,null,null,null,null,null,null,null,null,null,null,null,"1 573","1 741"]
[null,null,null,null,null,null,null,null,null,null,null,null,"1 395","1 420"]
[null,null,null,null,null,null,null,null,null,null,null,null,"2,0 TDI","1.5 TDCi SS"]
[null,null,null,null,null,null,null,null,null,null,null,null,"(5.4,141,110,150)","(5.5,144,74,101)"]
[]
[]
[null,null,null,null,null,null,null,null,null,null,null,null,"T-Roc, Design, Sport","Trend, Titanium, Sport"]
[]
[null,null,null,null,null,null,null,null,null,null,null,null,null,"Höhe entspricht"]
[null,null,null,null,null,null,null,null,null,null,null,null,null,"Kompakt-Van"]
[]
[]
[]
[]
[]
[]
[]
[null,null,"Peugeot","BMW","Citroen","Renault","Seat","Fiat","Ford","Hyundai","Mini","Skoda"]
["nach diesem Kriterium sortieren","Modell",2008,"2er Active Tourer","C3 Aircross","Captur","Arona","500X Urban","EcoSport","Kona","Countryman","Kamiq"]
["nach diesem Kriterium sortieren","Motor","BlueHDi 100","216d","Blue HDi 100","Blue dCi 115","1.6 TDI","1.6 MultiJet","1.5 l EcoBlue","1.6 CRDi","One","1.6l TDI"]
[null,null,null,null,"S&S",null,null,"95 SCR"]
["nach diesem Kriterium sortieren","Kaufpreis bei","25 510","32 050","20 790","24 890","19 990","22 100","23 700","22 690","28 500","24 050"]
[null,"Grundausstattung"]
[null,"[ab EUR] inkl MWSt."]
["nach diesem Kriterium sortieren","Kraftstoffver-",4.5,4.7,4.7,4.7,4.8,4.8,4.9000000000000004,5,4.9000000000000004,5]
[null,"brauch [l/100km]"]
["nach diesem Kriterium sortieren","CO2-Emissionen",118,123,123,123,125,126,129,129,129,131]
[null,"[g/km]"]
["nach diesem Kriterium sortieren","EU-Abgasnorm","6d-TEMP","6d","6d-TEMP","6d-TEMP","6d-TEMP","6d-TEMP-EVAP-ISC","6d-TEMP-EVAP-ISC","6d-TEMP-EVAP","6d-TEMP","6d-TEMP-EVAP-ISC"]
["nach diesem Kriterium sortieren","Sitzplätze",5,5,5,5,5,5,5,5,5,5]
["nach diesem Kriterium sortieren","Leistung",75,85,75,85,70,70,74,85,85,85]
[null,"[kW]"]
["nach diesem Kriterium sortieren","Leistung",100,116,102,115,95,95,100,116,116,115]
[null,"[PS]"]
["nach diesem Kriterium sortieren","Getriebe","M6","M6","M6","M6","M5","M5","M6","M6","M6","M6"]
["nach diesem Kriterium sortieren","Länge [mm]","4 300","4 354","4 154","4 227","4 138","4 264","4 096","4 165","4 299","4 241"]
["nach diesem Kriterium sortieren","Breite [mm]","1 987","2 039","1 976","2 003","1 942","2 025","2 057","2 070","1 822","1 988"]
["nach diesem Kriterium sortieren","Höhe [mm]","1 530","1 555","1 597","1 576","1 543","1 595","1 653","1 550","1 557","1 553"]
["nach diesem Kriterium sortieren","Leergewicht [kg]","1 205","1 495","1 292","1 490","1 297","1 320","1 395","1 318","1 505","1 336"]
["nach diesem Kriterium sortieren","andere Motoren","BlueHDi 130","218d","Blue HDi 120",null,null,"1.6 MultiJet","1.5 EcoBlue","1.6 CRDi","Cooper D"]
[null,"(Verbrauch, CO2-Emissionen,","(4.9,129,96,130)","(4.9,129,110,150)","(5.2,137,88,120)",null,null,"(5.2,137,88,120)","(5.3,138,88,120)","(5.1,134,100,136)","(5.0,130,110,150)"]
[null,"Leistung [kW], Leistung [PS])",null,"220d",null,null,null,null,null,null,"Cooper SD"]
[null,null,null,"(5.1,134,140,190)",null,null,null,null,null,null,"(5.3,139,140,190)"]
["nach diesem Kriterium sortieren","Modellvarianten","Allure, Active,",null,"Feel, Shine","Life, Zen,","Reference, Style,","Lounge, Cross, Sport","ST-Line, Titanium","Level 2,3,4,6","One, Cooper","Active, Ambition"]
[null,null,"GT-Line",null,null,"Intens, Edition One","Xcellence",null,"Cool&Connect",null,null,"Style, Monte Carlo"]
["Anmerkung",null,"Länge entspricht","Länge entspricht",null,"Länge entspricht",null,"Länge entspricht","Höhe entspricht",null,"Länge entspricht"]
[null,null,"Kompakt-Van","Kompakt-Van",null,"Kompakt-Van",null,"Kompakt-Van","Kompakt-Van",null,"Kompakt-Van"]
[]
[]
[]
[]
[]
[]
[]
[]
[]
[]
[null,null,null,null,null,null,null,null,null,null,null,null,"6d-TEMP",4,53,null,72,null,"M5",3475,1884,1460,915,null,null,null,"Active,","Allure, Collection",null,"Als 3-Türer oder","5-Türer erhältlich"]
[null,null,null,null,null,null,null,null,null,null,null,null,"6d-TEMP",4,53,null,72,null,"M5",3466,1884,1460,867,null,null,null,"Feel, Shine, Origins"]
[null,null,null,null,null,null,null,null,null,null,null,null,"6d-TEMP-EVAP",4,49,null,67,null,"M5",3670,1680,1480,924,"1.2l (5.2,117,62,84)",null,null,"Level 1,2,3,4",null,null,"Auch als 5-Sitzer","erhältlich"]
[null,null,null,null,null,null,null,null,null,null,null,null,"6d-TEMP-EVAP-ISC",4,53,null,72,null,"M5",3465,1615,1460,840,null,null,null,"x, x-play,","x-cite, x-clusiv,","x-style"]
[null,null,null,null,null,null,null,null,null,null,null,null,"6d-TEMP",5,52,null,71,null,"M5",3795,1665,1505,870,"1.2 MIVEC AS&G","(5.3, 121, 59, 80)",null,"Inform,","Invite Connect"]
[null,null,null,null,null,null,null,null,null,null,null,null,"6d-TEMP-EVAP",5,66,null,90,null,"M5",3840,1735,1480,857,null,null,null,"Clear, Shine"]
[null,null,null,null,null,null,null,null,null,null,null,null,"6d-TEMP-EVAP",4,49,null,67,null,"M5",3595,1595,1485,588,"1.2 MPI ISG","(5.6,126,62,84)",null,"Neon, Titan, Silber,","Gold, GT-Line, X-Line",null,"Auch als 5-Sitzer","erhältlich"]
[null,null,null,null,null,null,null,null,null,null,null,null,"6d-TEMP-EVAP",4,54,null,74,null,"M5",3615,1646,1541,981,"TCe 95","(5.3,119,68,93)",null,"Life, Intens, Zen"]
[null,null,null,null,null,null,null,null,null,null,null,null,"6d-TEMP-EVAP-ISC",5,70,null,95,null,"M5",3997,1958,1467,1116,"1.0 MPI","(5.8,132,44,60)",null,"Active, Ambition,","Style, Monte Carlo",null,"Auch als Combi","erhältlich "]
[null,null,null,null,null,null,null,null,null,null,null,null,"6d-TEMP-EVAP-ISC",5,44,null,60,null,"M5",3600,1910,1504,980,"1.0l","(5.3,120,85,115)",null,"black style,","white style,","R-Line, GTI"]
[null,null,null,null,null,null,null,null,null,null,null,null,"6d-TEMP",4,70,null,95,null,"M5",3954,1906,1416,1110,"30 TSFI","(4.8,122,85,116)",null,"advanced,","S-line"]
[null,null,null,null,null,null,null,null,null,null,null,null,"6d-TEMP",5,74,null,100,null,"M5",3999,1935,1455,1135,"DIG-T 117","(5.9,133,86,117)",null,"Visia, Acenta, Tekna,","N-Connecta,","Visia Plus"]
[null,null,null,null,null,null,null,null,null,null,null,null,"6d-TEMP-EVAP",5,61,null,83,null,"M5",3996,2009,1490,1037,"PureTech 110","(5.8,131,81,110)",null,"Feel, Shine"]
[null,null,null,null,null,null,null,null,null,null,null,null,"6d-TEMP-EVAP-ISC",5,53,null,72,null,"M5",3945,1695,1510,980,"1.5 VVT-i","(6.0,135,82,111)",null,"Young, Active,","Lounge"]
[null,null,null,null,null,null,null,null,null,null,null,null,"6d-TEMP",4,55,null,75,null,"M6",3821,1727,1414,1215,"One (5.0,114,75,102),","Cooper","(5.0,115,100,136)","Salt, Pepper, Chili",null,null,"Auch als 5-Türer","erhältlich"]
[null,null,null,null,null,null,null,null,null,null,null,null,"6d-TEMP-EVAP",4,51,null,69,null,"A5",3571,1627,1488,900,null,null,null,"500C, 500S","Lounge, Sport","Star, Rockstar","Hybrid-Variante"]
[null,null,null,null,null,null,null,null,null,null,null,null,"6d-TEMP-EVAP-ISC",5,70,null,95,null,"M6",4065,1941,1466,1163,"1.1l","(5.3,120,55,75)","1.0 Ecoboost","(5.1,115,70,95)","1.0 Ecoboost","(5.6,127,92,125)","Trend, Cool-Connect,","Titanium, ST-Line",null,"Auch als 5-Türer","erhältlich"]
[null,null,null,null,null,null,null,null,null,null,null,null,"6d-TEMP-EVAP-ISC",5,74,null,100,null,"M6",4378,1979,1471,1322,"1.0 EcoBoost","(5.5, 124, 92, 125)","1.0 EcoBoost","(5.9,133,92,125)","1.5 EcoBoost","(6.3,142,110,150)","Trend, Titanium,","Active, ST-Line,","Vignale, Cool-Connect","Auch als Kombi","erhältlich "]
[null,null,null,null,null,null,null,null,null,null,null,null,"6d",5,81,null,110,null,"M6",4370,2042,1485,1280,"1.2 TDI","(5.3,120,96,130)","1.2 TDI","(5.3,120,107,145)",null,null,"Edition, GS-Line,","Elegance, Ultimate",null,"Auch als Kombi","erhältlich "]
[null,null,null,null,null,null,null,null,null,null,null,null,"6d-TEMP-EVAP-ISC",5,70,null,95,null,"M5",4262,1958,1488,1136,null,null,null,null,null,null,"Active, Amibition,","Style, Monte Carlo"]
[null,null,null,null,null,null,null,null,null,null,null,null,"6d",5,55,null,75,null,"M6",4070,1695,1495,1100,"G90","(5.3,120,66,90)",null,null,null,null,"Life, Takumi,","Takumi Plus"]
[null,null,null,null,null,null,null,null,null,null,null,null,"6d-TEMP-EVAP",5,53,null,72,null,"M5",4050,1988,1440,1148,"TCe 100","(5.1,116,74,100)","TCe 130","(5.7,130,96,130)",null,null,"Life, Zen, Intens,","R.S. Line, Initiale",null,"Auch als Kombi","erhältlich "]
[null,null,null,null,null,null,null,null,null,null,null,null,"6d-TEMP-EVAP-ISC",5,85,null,115,null,"M6",4053,1964,1461,1120,"1.0 (5.4,123,44,60)",null,null,null,null,null,"Comfortline,","Highline, GTI"]
[null,null,null,null,null,null,null,null,null,null,null,null,"6d-TEMP",5,59,null,80,null,"M5",4059,1942,1444,1099,"1.0 ECO TSI","(5.5,123,70,95)","1.0 ECO TSI","(5.4,122,85,115)","1.0 (4.9,112,59,80)",null,"Fast Lane, Style,","Xcellence,FR","Reference"]
[null,null,null,null,null,null,null,null,null,null,null,null,"6d-TEMP",5,81,null,110,null,"M6",4282,1816,1459,1202,null,null,null,null,null,null,"Style, FR",null,null,"Auch als Kombi","erhältlich "]
[null,null,null,null,null,null,null,null,null,null,null,null,"6d-TEMP-EVAP-ISC",5,96,null,130,null,"M6",4284,1789,1491,1315,null,null,null,null,null,null,"Life"]
[null,null,null,null,null,null,null,null,null,null,null,null,"6d",5,55,null,75,null,"M5",4060,1960,1433,1055,"1.2 (5.5,124,74,100)","1.2 (5.6,128,96,130)",null,null,null,null,"Edition, Elegance,","GS-Line"]
[null,null,null,null,null,null,null,null,null,null,null,null,"6d",5,55,null,75,null,"M5",4055,1960,1430,1055,"PureTech 100","(5.4,123,74,101)","PureTech 130","(5.6,127,96,131)",null,null,"Like, Active, Allure","GT-Line, GT"]
[null,null,null,null,null,null,null,null,null,null,null,null,"6d-TEMP-EVAP",5,74,null,100,null,"M5",4035,1734,1474,1065,"1.25l","(5.9,133,55,75)","1.25l","(5.8,132,62,84)","1.0 TGDI","(5.6,137,88,120)","Level 1,2,3,4,5"]
[null,null,null,null,null,null,null,null,null,null,null,null,"6d-TEMP-EVAP",5,74,null,100,null,"M5",4065,1725,1450,1080,"1.25 MPI ISG","(5.8,132,62,84)","1.0 TGDI GPF ISG","(5.8,133,88,120)",null,null,"Neon, Titan, Silber,","Gold, GT-Line"]
[null,null,null,null,null,null,null,null,null,null,null,null,"6d-TEMP-EVAP",5,74,null,100,null,"M6",4310,1800,1447,1222,"1.0 TGDI GPF ISG","(5.6,126,88,120)","1.4 TGDI GPF ISG","(5.9,135,103,140)",null,null,"Titan, Silber,Gold","Platin, GT-Line, GT",null,"Auch als Kombi","erhältlich "]
[null,null,null,null,null,null,null,null,null,null,null,null,"6d-TEMP-EVAP-ISC",5,70,null,95,null,"M5",4362,1988,1471,1192,"1.0 TSI","(5.5,124,85,115)","1.5 TSI","(5.7,130,110,150)",null,null,"Active, Amibition,","Style, Monte Carlo"]
[null,null,null,null,null,null,null,null,null,null,null,null,"6d-TEMP-EVAP-ISC",5,74,null,100,null,"M6",4668,1979,1494,1383,"1.0 EcoBoost","(5.6,126,92,125)","1.5 EcoBoost","(5.8,132,110,150)","1.5 EcoBoost","(6.0,137,134,182)","Trend, Titanium,","Active, ST-Line,","Vignale, Cool-Connect"]
[null,null,null,null,null,null,null,null,null,null,null,null,"6d-TEMP-EVAP-ISC",5,84,null,115,null,"M6",4689,1994,1468,1285,"1.5 TSI","(5.7, 129, 110, 150)",null,null,null,null,"Business, Premium"]
[null,null,null,null,null,null,null,null,null,null,null,null,"6d",5,81,null,110,null,"M6",4702,2040,1510,1355,"1.2 TDI","(5.4,122,96,130)","1.2 TDI","(5.4,122,107,145)",null,null,"Edition, GS Line,","Elegance, Ultimate"]
[2021,null,null,null,null,null,null,null,null,null,null,null,"6d-TEMP-EVAP",5,88,null,120,null,"M6",4585,2039,1465,1231,"1.5 DPI","(6.0,137,81,110)",null,null,null,null,"Level 2,3,4,5,6"]
[null,null,null,null,null,null,null,null,null,null,null,null,"6d-TEMP-EVAP-ISC",5,85,null,116,null,"M6",4567,2027,1515,1300,"1.5 TSI","(5.6,128, 96, 131)","1.5 TSI","(5.7, 130, 110, 150)",null,null,"Rabbit, Comfortline"]
["Peugeot ",108,"1.0 VTi 72",null,null,12740,null,null,4.8,"BENZIN",109,null,"6d-TEMP-EVAP",5,74,null,100,null,"M6",4600,1800,1465,1259,"1.4 TGDI ISG","(5.9,135,103,140)",null,null,null,null,"Titan, Silber, Gold,","Platin, GT-Line, GT"]
["Citroen","C1 ","VTi 72",null,null,11490,null,null,4.8,"BENZIN",110,null,"6d-TEMP",5,93,null,126,null,"M6",4518,2076,1434,1229,"1.5 VTEC Turbo","(6.1,139,134,182)",null,null,null,null,"Comfort, Elegance,","Executive, Sport, S"]
["Hyundai","i10","1.0l",null,null,10990,null,null,4.8,"BENZIN",110,null,"6d-TEMP",5,54,null,73,null,"M5",4501,1994,1521,1112,"TCe 90 S&S","(5.9,133,66,90)",null,null,null,null,"Access, Essential,","Comfort, Stepway,","Celebration"]
["Toyota","Aygo","1.0 VVT-i",null,null,11490,null,null,5,"BENZIN",112,null,"6d ISC-FCM",5,100,null,136,null,"M6",4549,1796,1446,1360,"A 200","(5.8,131,120,163)"]
["MItsubishi","Space Star","1.0 MIVEC AS&G",null,null,12990,null,null,5.0999999999999996,"BENZIN",115,null,"6d-TEMP-EVAP-ISC",5,110,null,150,null,"M6",4775,2083,1483,1425,"2.0 TSI","(7.6,171,140,190)",null,null,null,null,"Business, Elegance"]
["Suzuki","Swift","1.2 Dualjet",null,null,13490,null,null,5.0999999999999996,"BENZIN",115,null,"6d",5,81,null,110,null,"M6",4585,2043,1472,1205,"PureTech 130","(5.8, 130, 96, 131)",null,null,null,null,"Active, Style,","Access, Allure,","GT-Line, GT"]
["KIA","Picanto","1.0 MPI ISG",null,null,10190,null,null,5.0999999999999996,"BENZIN",116,null,"6d-TEMP-EVAP",5,84,null,115,null,"M6",4626,2058,1457,1231,"TCe 140","(6.0,136,103,140)","TCe 160","(6.2,140,117,159)",null,null,"Intens, Life, Bose","GT-Line, Limited"]
["Renault","Twingo","SCe 75",null,null,9990,null,null,5.3,"BENZIN",119,null,"6d-TEMP",5,103,null,140,null,"M6",4897,2093,1455,1441,"1.5 TDI","(6.1,138,121,165)",null,null,null,null,"Edition, Dynamic,","Innovation,","Ultimate","Auch als Combi"]
["Skoda","Fabia","1.0 TSI",null,null,13240,null,null,5.4,"BENZIN",123,null,"6d-TEMP",5,85,null,116,null,"M6",4650,1790,1435,1205,null,null,null,null,null,null,"Young, Active, Style"]
["VW","up!","1.0l",null,null,12680,null,null,5.4,"BENZIN",123,null,"6d-TEMP-EVAP-ISC",5,110,null,150,null,"M6",4861,1864,1458,1435,null,null,null,null,null,null,"Active, Ambition,","Style, Sportline",null,"Auch als Combi"]
["Audi","A1 SB","25 TSFI",null,null,21780,null,null,5.6,"BENZIN",126,null,"6d",5,133,null,181,null,"A8",4750,2079,1403,1420,null,null,null,null,null,null,"Allure, GT Line",null,null,"Auch als Combi"]
["Nissan","Micra","1.0 IGT 100",null,null,15090,null,null,5.6,"BENZIN",126,null,"6d-TEMP-EVAP",4,66,null,90,null,"A5",3700,1660,1595,860,null,null,null,null,"Clear, Shine"]
["Citroen","C3","PureTech 82",null,null,13390,null,null,5.7,"BENZIN",127,null,"6d-TEMP",5,70,null,95,null,"M5",4138,1780,1552,1180,"1.0 Eco TSI","(5.8,131,85,115)",null,null,"Style, Xcellence,","Reference, FR"]
["Toyota","Yaris","1.0 VVT-i",null,null,13190,null,null,5.8,"BENZIN",131,null,"6d-TEMP",5,54,null,73,null,"M5",4069,1994,1555,1052,"TCe 90","(5.9,133,66,90)",null,null,"Access, Essential,","Comfort, Stepway,","Celebration"]
["Mini","Mini 3-Türer","One First",null,null,19750,null,null,5.8,"BENZIN",133,null,"6d-TEMP-EVAP-ISC",4,51,null,69,null,"M5",3653,1882,1551,980,null,null,null,null,"Easy, Lounge",null,null,"Auch als 5-Sitzer","erhältlich"]
["Fiat",500,"1.2 Fire 70","Dualogic",null,18170,null,null,5.5,"BENZIN",135,null,"6d-TEMP-EVAP-ISC",5,70,null,95,null,"M5",4108,1977,1584,1245,"1.0 TSI","(6.0,137,85,115)",null,null,"Life, Style"]
["Ford","Fiesta Coupe","1.0 Ecoboost","Start&Stop",null,15300,null,null,5.0999999999999996,"BENZIN",115,null,"6d-TEMP-EVAP-ISC",5,74,null,100,null,"M6",4096,2057,1653,1349,"1.0 EcoBoost","(6.0,135,92,125)","1.0 EcoBoost","(6.0,136,103,140)","ST-Line, Trend","Titanium,","Cool & Connect","Höhe entspricht","Kompakt-Van"]
["Ford","Focus","1.0 EcoBoost",null,null,22100,null,null,5.3,"BENZIN",119,null,"6d-TEMP",5,74,null,100,null,"M5",4227,2003,1576,1248,"TCe 130","(6.3,141,96,130)",null,null,"Life, Zen, Intens,","Edition One, Initiale",null,"Länge entspricht","Kompakt-Van"]
["Opel","Astra","1.2 Turbo","Direct Injection",null,21739,null,null,5.2,"BENZIN",119,null,"6d-TEMP",5,86,null,117,null,"M6",4210,1983,1595,1182,null,null,null,null,"Visia, Acenta,","N-Connecta, Tekna,","N-Design","Länge entspricht","Kompakt-Van"]
["Skoda","Fabia Combi","1.0 TSI",null,null,13590,null,null,5.3,"BENZIN",119,null,"6d-TEMP-EVAP",5,81,null,110,null,"M6",4154,1976,1597,1247,"PureTech 130","(6.6,148,96,130)",null,null,"Feel, Shine, C-Series"]
["Mazda",2,"G75 Life",null,null,14690,null,null,5.3,"BENZIN",120,null,"6d-TEMP-EVAP",5,88,null,120,null,"M6",4165,2070,1550,1223,null,null,null,null,"Level 2,3,4,6"]
["Renault","Clio","SCe 75",null,null,12940,null,null,5.4,"BENZIN",120,null,"6d-TEMP",5,103,null,140,null,"M6",4170,1775,1595,1205,null,null,null,null,"clear, shine"]
["VW","Polo","1.0 TSI",null,null,15110,null,null,5.3,"BENZIN",120,null,"6d-TEMP-EVAP-ISC",5,85,null,116,null,"M6",4351,2050,1613,1330,"1.5 TSI","(5.7,1130,96,131)","1.5 TSI","(6.5,147,110,150)","Highline, Comfortline"]
["Seat","Ibiza","1.0l",null,null,12990,null,null,5.4,"BENZIN",122,null,"6d-TEMP",5,74,null,100,null,"M5",4341,2052,1693,1191,"TCe 130","(6.6,149,96,130)","TCe 150","(7.1,162,110,150)","Access, Comfort,","Essential, Prestige,","Celebration"]
["Seat","Leon","1.0 TSI",null,null,19990,null,null,5.4,"BENZIN",122,null,"6d",5,60,null,81,null,"M5",4212,1976,1605,1174,"1.2 Turbo","(6.1,138,81,110)","1.2 Turbo","(5.9,134,96,130)","Edition, Ultimate","Innovation"]
["VW","Golf","1.5 TSI ACT",null,null,26990,null,null,5.4,"BENZIN",122,null,"6d-TEMP-EVAP-ISC",5,85,null,116,null,"M6",4382,2025,1603,1344,"1.5 TSI","(6.3,144,110,150)",null,null,"City, Amibition,","Style"]
["Opel","Corsa","1.2l",null,null,14999,null,null,5.4,"BENZIN",123,null,"6d-TEMP-EVAP",7,96,null,131,null,"M6",4597,2117,1638,1423,null,null,null,null,"Feel, Shine"]
["Peugeot",208,"PureTech 75","S&S",null,15990,null,null,5.4,"BENZIN",123,null,"6d",5,96,null,131,null,"M6",4447,2098,1624,1320,null,null,null,null,"Allure, Active,","Access, GT Line"]
["Hyundai","i20","1.0 T-GDI",null,null,17190,null,null,5.5,"BENZIN",126,null,"6d",5,96,null,130,null,"M6",4477,2098,1609,1350,"1.6 Turbo","(7.2,163,133,181)",null,null,"Edition, Ultimate","Innovation"]
["KIA","Rio","1.0 TGDI GPF ISG",null,null,18090,null,null,5.5,"BENZIN",126,null,"6d-TEMP",5,80,null,109,null,"AMT6",4556,1800,1608,1515,"218i","(6.5,146,103,140)","220i","(6.8,154,141,192)"]
["KIA","Ceed","1.0 TGDI GPF ISG",null,null,17790,null,null,5.6,"BENZIN",126,null,"6d-TEMP-EVAP",5,103,null,140,null,"M6",4489,2058,1607,1442,"TCe 160","(6.6,150,117,160)",null,null,"Life, Zen, Intens,","Black Edition"]
["Skoda","Scala","1.0 TSI",null,null,18980,null,null,5.5,"BENZIN",126,null,"6d-TEMP",5,85,null,116,null,"M6",4363,2078,1601,1313,"1.4 TSI","(6.4,145,110,150)",null,null,"Reference, Style,","Xcellence"]
["Ford","Focus Turnier","1.0 EcoBoost",null,null,23600,null,null,5.3,"BENZIN",119,null,"6d",5,96,null,131,null,"M6",4641,2098,1646,1410,null,null,null,null,"Allure, Active,","Access, GT Line",null,"Auch als 7-Sitzer","erhältlich"]
["Skoda","Octavia Combi","1.0 TSI",null,null,26880,null,null,5.3,"BENZIN",120,null,"6d-TEMP",5,96,null,131,null,"M6",4294,1772,1605,1243,null,null,null,null,"Comfort, Elegance,","Executive"]
["Opel","Astra ST","1.2 Turbo","Direct Injection",null,23339,null,null,5.4,"BENZIN",122,null,"6d-TEMP",5,96,null,131,null,"M6",4500,2099,1654,1468,null,null,null,null,"Live, Feel"]
["Hyundai","i30 Combi","1.0 T-GDI",null,null,20590,null,null,5.4,"BENZIN",123,null,"6d-TEMP",5,85,null,115,null,"M6",4406,2128,1653,1528,"TCe 140","(6.8,153,103,140)","TCe 160","(6.9,155,117,160)","Zen, Intens, Limited,","Bose, Initiale"]
["VW","Golf Variant","1.0 TSI",null,null,25570,null,null,5.6,"BENZIN",126,null,"6d-TEMP",5,110,null,150,null,"M6",4854,2081,1720,1695,null,null,null,null,"Executive,","Xcellence, FR",null,"Auch als 7-Sitzer","erhältlich"]
["KIA","Ceed SW","1.0 TGDI GPF ISG",null,null,18990,null,null,5.6,"BENZIN",127,null,"6d-TEMP",5,75,null,102,null,"M6",4060,1960,1433,1165,null,null,null,null,"Edition, GS-Line,","Elegance"]
["Honda","Civic","1.0 VTEC","Turbo",null,22890,null,null,5.7,"BENZIN",128,null,"6d-TEMP-EVAP-ISC",5,85,null,115,null,"M6",4284,1789,1491,1380,null,null,null,null,"Rabbit, Life, Style"]
["Dacia","Logan MCV","SCe 75 S&S",null,null,8590,null,null,5.7,"BENZIN",129,null,"6d-TEMP",5,75,null,102,null,"M6",4055,1960,1430,1165,null,null,null,null,"Like, Active,","Allure, GT Line"]
["Mercedes","A-Klasse","A 180",null,null,29670,null,null,5.9,"BENZIN",133,null,"6d-TEMP",5,63,null,85,null,"M6",4050,1988,1440,1277,"Blue dCi 115","(4.2,110,85,115)",null,null,"Life, Zen, Intens,","RS Line",null,null,"Auch als Clio","Grandtour erhältlich"]
["VW","Passat","1.5 TSI ACT",null,null,32590,null,null,5.8,"BENZIN",133,null,"6d-TEMP-EVAP-ISC",5,63,null,85,null,"M6",4040,1735,1476,1194,null,null,null,null,"Trend, Titanium","Cool&Connect,","ST-Line",null,"Auch als 5-Türer","erhältlich"]
["Peugeot","308 SW","PureTech 130","Start&Stop",null,23600,null,null,5.9,"BENZIN",134,null,"6d",5,77,null,105,null,"M6",4370,2042,1485,1371,"1.5 CDTI","(4.4,116,90,122)",null,null,"Edition, GS-Line,","Elegance, Ultimate"]
["Renault","Megane Grandtour","TCe 115",null,null,19290,null,null,5.9,"BENZIN",135,null,"6d-TEMP",5,85,null,115,null,"M6",4313,1785,1426,1360,"35 TDI","(4.4,115,110,150)",null,null,"sport, design"]
["Opel","Insignia","1.5 Turbo","Direct Injection",null,30730,null,null,6.1,"BENZIN",138,null,"6d-TEMP",5,55,null,75,null,"M5",4069,1994,1555,1190,"dCi 95","(4.4,116,70,95)",null,null,"Comfort, Stepway,","Celebration"]
["Toyota","Corolla Kombi","1.2 Turbo",null,null,22290,null,null,6.2,"BENZIN",140,null,"6d-TEMP-EVAP-ISC",5,70,null,95,null,"M6",4378,1825,1454,1363,"1.5 EcoBlue","(4.5,117,88,120)","2.0 EcoBlue","(4.7,124,110,150)","Trend, Titanium","ST-Line, Vignale,","Active,","Cool&Connect","Auch als Turnier","erhältlich"]
["Skoda","Superb","1.5 TSI",null,null,33840,null,null,6.2,"BENZIN",141,null,"6d-TEMP",5,85,null,115,null,"M6",4359,2058,1447,1315,null,null,null,null,"Life, Zen, Intens,","Edition One, RS Line"]
["Peugeot",508,"PureTech 180",null,null,42250,null,null,6.5,"BENZIN",145,null,"6d",5,85,null,115,null,"M6",4319,1799,1434,1375,"118d","(4.7,122,11,150)"]
["Suzuki","Ignis","1.2 Dualjet AGS",null,null,16390,null,null,5.6,"BENZIN",126,null,"6d-TEMP",5,75,null,102,null,"M6",4170,1979,1480,1148,"BlueHDi 120","(5.0, 130, 88, 120)",null,null,"Feel, Shine"]
["Seat","Arona","1.0 Eco TSI",null,null,16690,null,null,5.6,"BENZIN",128,null,"6d-TEMP-EVAP-ISC",5,88,null,120,null,"M6",4186,1930,1536,1280,null,null,null,null,"Titanium, ST-Line"]
["Dacia","Sandero","SCe 75",null,null,7790,null,null,5.7,"BENZIN",129,null,"6d-TEMP-EVAP",5,85,null,115,null,"M6",4340,1795,1455,1313,null,null,null,null,"Level 2,3,4,5,6",null,null,null,"Auch als Combi","erhältlich"]
["Fiat","Panda","1.2 Fire 70",null,null,12100,null,null,5.7,"BENZIN",133,null,"6d-TEMP-EVAP-ISC",5,70,null,95,null,"M6",4419,1796,1440,1425,"A180d","(4.5,118,85,116)","A200d","(4.8,125,110,150)"]
["VW","T-Cross","1.0 TSI",null,null,19790,null,null,5.9,"BENZIN",133,null,"6d-TEMP",5,75,null,102,null,"M6",4253,2043,1457,1205,"1.5 BlueHDi 130","(4.5,119,96,131)",null,null,"Active, Allure, Access,","GT-Line, Style"]
["Ford","EcoSport","1.0 EcoBoost",null,null,20300,null,null,5.9,"BENZIN",134,null,"6d",5,77,null,105,null,"M6",4702,2042,1485,1395,"1.5 CDTI","(4.4,116,90,122)",null,null,"Astra, Edition,","GS Line, Elegance,","Ultimate"]
["Renault","Captur","TCe 100",null,null,18540,null,null,5.9,"BENZIN",134,null,"6d-TEMP-EVAP-ISC",5,85,null,116,null,"M6",4689,1994,1468,1370,"2.0 TDI","(4.6,122,110,150)",null,null,"Business, Premium"]
["Nissan","Juke","DIG-T 117",null,null,19600,null,null,5.9,"BENZIN",135,null,"6d-TEMP-EVAP",5,85,null,116,null,"M6",4585,2039,1465,1370,"1.6 CRDi","(4.6,120,100,136)",null,null,"Level 2,3,4,5,6"]
["Citroen","C3 Aircross","PureTech 110","S&S",null,20320,null,null,6.2,"BENZIN",141,null,"6d-TEMP-EVAP-ISC",5,85,null,116,null,"M6",4688,1830,1439,1470,"200d","(4.8,125,110,150)","220d","(4.8,127,140,190)"]
["Hyundai","Kona","1.0 T-GDi",null,null,20690,null,null,6.2,"BENZIN",142,null,"6d-TEMP",5,85,null,116,null,"M6",4626,2058,1449,1315,null,null,null,null,"Limited, Intens,","Bose, GT-Line"]
["Suzuki","Vitara","1.4 DITC",null,null,26490,null,null,7.4,"BENZIN",167,null,"6d-TEMP-EVAP-ISC",5,70,null,95,null,"M6",4668,1979,1494,1413,"1.5 EcoBlue","(4.5,119,88,120)","2.0 EcoBlue","(4.7,124,110,150)","Trend, Titanium,","ST-Line, Vignale,","Active,","Cool&Connect"]
["VW","Golf Sportsvan","1.0 TSI ",null,null,27420,null,null,5.9,"BENZIN",133,null,"6d-TEMP-EVAP",5,70,null,95,null,"M5",4571,1792,1514,1395,"MultiJet 120 SCR","(5.1,130,88,120)",null,null,"Street, Mirror,","Lounge, S-Design"]
["Dacia","Duster","TCe 100",null,null,12990,null,null,6.1,"BENZIN",138,null,"6d-TEMP",5,96,null,130,null,"M6",4750,2079,1403,1415,"BlueHDI 160","(5.5,144,120,163),","BlueHDI 180","(5.7,150,130,177)","Active, Allure,","GT Line, GT",null,null,"Auch als Combi","erhältlich"]
["Opel","Crossland X","1.2l",null,null,19839,null,null,6.2,"BENZIN",139,null,"6d-TEMP",5,88,null,120,null,"M6",4518,2079,1434,1342,null,null,null,null,"Elegance, Executive,","S, Comfort"]
["Skoda","Karoq","1.0 TSI",null,null,23980,null,null,6.3,"BENZIN",142,null,"6d-TEMP-EVAP",5,85,null,116,null,"M6",4600,1800,1465,1350,"1.6 CRDi ISG","(4.8,125,100,136)",null,null,"Gold, Silber","Titan, Platin,","GT-Line"]
["Citroen","Grand C4 Spacetourer","PureTech 130","Start&Stop",null,28550,null,null,6.3,"BENZIN",143,null,"6d-TEMP",5,90,null,122,null,"M6",4897,2093,1455,1503,"2.0 CDTI","(4.7,122,128,174)",null,null,"Edition, Business","Elegance",null,null,"Auch als Combi","erhältlich"]
["Peugeot",3008,"PureTech 130",null,null,26790,null,null,6.3,"BENZIN",144,null,"6d-TEMP",5,96,null,130,null,"M6",4585,2043,1472,1205,null,null,null,null,"Active, Allure,","GT Line, Access,","Style"]
["Opel","Grandland X","1.2 Turbo",null,null,26729,null,null,6.4,"BENZIN",145,null,"6d-TEMP-EVAP-ISC",5,110,null,150,null,"M6",4775,2083,1483,1525,"1.6 TDI","(5.4,141,88,120)",null,null,"Business, Elegance",null,null,null,"Auch als Passat","Variant erhältlich"]
["BMW","2er Gran Tourer","216i",null,null,31350,null,null,6.4,"BENZIN",146,null,"6d-TEMP",5,110,null,150,null,"M6",4709,2068,1435,1520,"320d","(4.9,128,140,190)",null,null,null,null,null,null,"Auch als Combi","erhältlich"]
["Renault","Kadjar","TCe 140",null,null,22890,null,null,6.5,"BENZIN",146,null,"6d-ISC-FCM",5,118,null,160,null,"M6",4686,1810,1442,1555,"180d","(5.0,130,90,122)","220d","(5.0,132,143,194)",null,null,null,null,"Auch als Combi","erhältlich"]
["Seat","Ateca","1.0 Eco TSI",null,null,16690,null,null,6.5,"BENZIN",146,null,"6d-TEMP",5,90,null,122,null,"M6",4762,2022,1428,1540,"35 TDI","(5.0,131,120,163)","40 TDI","(5.2,136,140,190)","advanced, S line",null,null,null,"Auch als Combi","erhältlich"]
["Peugeot",5008,"PureTech 130",null,null,28790,null,null,6.5,"BENZIN",147,null,"6d-TEMP",5,88,null,120,null,"M6",4871,2121,1482,1707,"2.0l EcoBlue","(5.0,131,110,150)","2.0l EcoBlue","(5.3,140,140,190)","Trend, Titanium,","ST-Line, Vignale"]
["Honda","HR-V","1,5 i-VTEC",null,null,23290,null,null,6.6,"BENZIN",148,null,"6d-TEMP",5,75,null,100,null,"M6",4300,1987,1530,1205,"BlueHDi 130","(4.9,129,96,130)",null,null,"Allure, Active,","GT-Line","Länge entspricht","Kompakt-Van"]
["Citroen","C5 Aircross","PureTech 130","Start&Stop",null,26690,null,null,6.6,"BENZIN",149,null,"6d",5,85,null,116,null,"M6",4354,2039,1555,1495,"218d","(4.9,129,110,150)","220d","(5.1,134,140,190)",null,null,"Länge entspricht","Kompakt-Van"]
["Renault","Scenic","TCe 115",null,null,21390,null,null,6.6,"BENZIN",149,null,"6d-TEMP",5,75,null,102,null,"M6",4154,1976,1597,1292,"Blue HDi 120","(5.2,137,88,120)",null,null,"Feel, Shine"]
["Seat","Alhambra","1.4 TSI",null,null,40130,null,null,6.5,"BENZIN",150,null,"6d-TEMP",5,85,null,115,null,"M6",4227,2003,1576,1490,null,null,null,null,"Life, Zen,","Intens, Edition One","Länge entspricht","Kompakt-Van"]
["Opel","Corsa","2021-05-01",null,null,20389,null,null,4.0999999999999996,"BENZIN",107,null,"6d-TEMP",5,70,null,95,null,"M5",4138,1942,1543,1297,null,null,null,null,"Reference, Style,","Xcellence"]
["VW","Golf","2.0 TDI",null,null,29390,null,null,4.0999999999999996,"BENZIN",107,null,"6d-TEMP-EVAP-ISC",5,70,null,95,null,"M5",4264,2025,1595,1320,"1.6 MultiJet","(5.2,137,88,120)",null,null,"Lounge, Cross, Sport",null,"Länge entspricht","Kompakt-Van"]
["Peugeot",208,"BlueHDi 100","Start&Stop",null,19530,null,null,4.0999999999999996,"BENZIN",108,null,"6d-TEMP-EVAP-ISC",5,74,null,100,null,"M6",4096,2057,1653,1395,"1.5 EcoBlue","(5.3,138,88,120)",null,null,"ST-Line, Titanium","Cool&Connect","Höhe entspricht","Kompakt-Van"]
["Renault","Clio","Blue dCi 85",null,null,18790,null,null,4.2,"BENZIN",109,null,"6d-TEMP-EVAP",5,85,null,116,null,"M6",4165,2070,1550,1318,"1.6 CRDi","(5.1,134,100,136)",null,null,"Level 2,3,4,6"]
["Ford","Fiesta","1.5 TDCi","Start&Stop",null,16650,null,null,4.2,"BENZIN",111,null,"6d-TEMP",5,85,null,116,null,"M6",4299,1822,1557,1505,"Cooper D","(5.0,130,110,150)","Cooper SD","(5.3,139,140,190)","One, Cooper",null,"Länge entspricht","Kompakt-Van"]
["Opel","Astra","1.5 CDTI",null,null,23739,null,null,4.3,"BENZIN",112,null,"6d-TEMP-EVAP-ISC",5,85,null,115,null,"M6",4241,1988,1553,1336,null,null,null,null,"Active, Ambition","Style, Monte Carlo"]
["Audi","A3 SB","30 TDI",null,null,29600,null,null,4.4000000000000004,"BENZIN",114,null,"6d-TEMP-EVAP-ISC",5,85,null,115,null,"M6",4234,1992,1573,1395,"2,0 TDI","(5.4,141,110,150)",null,null,"T-Roc, Design, Sport"]
["Dacia","Sandero","Blue dCi 75","S&S",null,11340,null,null,4.4000000000000004,"BENZIN",116,null,"6d-TEMP-EVAP-ISC",5,55,null,75,null,"M6",4157,2112,1741,1420,"1.5 TDCi SS","(5.5,144,74,101)",null,null,"Trend, Titanium, Sport",null,"Höhe entspricht","Kompakt-Van"]
["Ford","Focus","1.5 l EcoBlue",null,null,23650,null,null,4.5,"BENZIN",117,null,"6d-TEMP",5,75,null,102,null,"M6",4212,1976,1605,1289,"1.5 CDTI","(5.2,137,88,120)",null,null,"Edition, Innovation,","Ultimate"]
["Renault","Megane","Blue dCi 115",null,null,24090,null,null,4.5,"BENZIN",117,null,"6d-TEMP",5,70,null,95,null,"M6",4498,2004,1682,1263,"Blue dCi 115","(4.8,126,85,115)",null,null,"Supreme, Stepway",null,null,"Auch als 7-Sitzer","erhältlich"]
["BMW","1er Limousine","116d",null,null,31160,null,null,4.5,"BENZIN",118,null,"6d",5,85,null,116,null,"M6",4565,2038,1606,1560,"218d","(5.1,134,110,150)","220d","(5.3,140,140,190)",null,null,null,"Auch als 7-Sitzer","erhältlich"]
["Citroen","C4 Cactus","BlueHDi 100","S&S",null,20275,null,null,4.5,"BENZIN",118,null,"6d-TEMP",5,70,null,95,null,"M6",4341,2052,1693,1314,"Blue dCi 115","(4.9,128,85,115)",null,null,"Essential, Comfort,","Prestige, Celebration"]
["Ford","Puma","1.5 l EcoBlue",null,null,25890,null,null,4.5,"BENZIN",118,null,"6d-TEMP",5,96,null,130,null,"M6",4438,1826,1610,1410,null,null,null,null,"Feel",null,null,"Auch als Grand","Spacetourer erhältlich"]
["Hyundai","i30","1.6 CRDi",null,null,22590,null,null,4.5999999999999996,"BENZIN",118,null,"6d-TEMP",5,85,null,115,null,"M6",4489,2058,1613,1531,"Blue dCi 150","(5.5,145,110,150)",null,null,"Zen, Intens,","Black Edition"]
["Mercedes","A-Klasse","160 d",null,null,29590,null,null,4.5,"BENZIN",118,null,"6d-TEMP",5,70,null,95,null,"M6",4363,2004,1804,1368,null,null,null,null,"Supreme, Stepway"]
["Peugeot",308,"BlueHDi 100",null,null,23850,null,null,4.5,"BENZIN",118,null,"6d-TEMP",5,88,null,120,null,"M6",4294,1772,1689,1395,null,null,null,null,"Comfort. Elegance,","Executive"]
["Opel","Astra Sports Tourer","1.5 CDTI",null,null,25339,null,null,4.3,"BENZIN",113,null,"6d-TEMP-EVAP",5,85,null,116,null,"M6",4485,1855,1635,1534,"1.6 CRDI SCR","(5.4,141,100,136)",null,null,"Titan, Silber,","Gold, Platin,","GT-Line"]
["Skoda","Octavia Combi","2.0 l TDI",null,null,29970,null,null,4.4000000000000004,"BENZIN",117,null,"6d-TEMP",5,96,null,130,null,"A8",4573,2098,1625,1527,"BlueHDI 180","(6.1,161,130,180)",null,null,"Be Chic, So Chic,","Performance Line"]
["Hyundai","i30 CW","1.6 CRDi",null,null,22590,null,null,4.5,"BENZIN",118,null,"6d-TEMP",5,96,null,130,null,"M6",4477,2098,1609,1435,null,null,null,null,"Edition, Innovation,","Ultimate"]
["Mercedes","CLA-Klasse","180 d",null,null,35460,null,null,4.5,"BENZIN",118,null,"6d-TEMP",5,96,null,130,null,"M6",4447,2098,1624,1417,"BlueHDI 180","(6.1,162,130,180)",null,null,"Allure, GT Line,","Active, Crossway"]
["Renault","Megane Grandtour","Blue dCi 115",null,null,25090,null,null,4.5,"BENZIN",118,null,"6d-TEMP-EVAP-ISC",5,85,null,116,null,"M5",4351,2050,1613,1440,"2.0 TDI","(5.4,142,110,150)",null,null,"Comfortline,","Highline"]
["Ford","Focus Turnier","1.5 EcoBlue",null,null,25150,null,null,4.5,"BENZIN",119,null,"6d-TEMP",5,96,null,130,null,"M6",4641,2098,1646,1430,null,null,null,null,"Allure, GT Line,","Active, Crossway",null,"Auch als 7-Sitzer","erhältlich"]
["Fiat","Tipo Kombi","MultiJet 95 SCR",null,null,21170,null,null,4.5999999999999996,"BENZIN",120,null,"6d-TEMP",5,96,null,130,null,"M6",4500,1969,1654,1507,null,null,null,null,"Live, Feel,","Shine, C-Series"]
["Peugeot",508,"BlueHDi 130",null,null,36750,null,null,4.7,"BENZIN",120,null,"6d-TEMP",5,85,null,116,null,"M6",4363,2078,1601,1428,"2.0 TDI","(5.4,142,110,150)",null,null,"Reference, Style,","Xcellence"]
["Honda","Civic","1.6i-DTEC",null,null,24390,null,null,4.5999999999999996,"BENZIN",121,null,"6d-TEMP",5,75,null,102,null,"M5",3996,2009,1474,1146,null,null,null,"Feel, Shine"]
["KIA","ceed SW","1.6 CRDi ISG",null,null,22790,null,null,4.5999999999999996,"BENZIN",121,null,"6d-TEMP",5,75,null,102,null,"M6","4 060","1 960","1 433","1 165",null,null,null,null,"Edition, GS-Line,","Elegance"]
["Opel","Insignia ","1.5 CDTI",null,null,32699,null,null,4.5999999999999996,"BENZIN",121,null,"6d-TEMP-EVAP-ISC",5,85,null,115,null,"M6","4 284","1 789","1 491","1 380",null,null,null,null,"Rabbit, Life, Style"]
["Peugeot","308 SW","BlueHDi 130",null,null,27800,null,null,4.7,"BENZIN",122,null,"6d-TEMP",5,75,null,102,null,"M6","4 055","1 960","1 430","1 165",null,null,null,null,"Like, Active,","Allure, GT Line"]
["VW","Passat Limousine","2.0 TDI",null,null,36659,null,null,4.7,"BENZIN",122,null,"6d-TEMP",5,63,null,85,null,"M6","4 050","1 988","1 440","1 277","Blue dCi 115","(4.2,110,85,115)",null,null,"Life, Zen, Intens,","RS Line",null,null,"Auch als Clio","Grandtour erhältlich"]
["BMW","3er Limousine","318d",null,null,38950,null,null,4.8,"BENZIN",125,null,"6d-TEMP-EVAP-ISC",5,63,null,85,null,"M6","4 040","1 735","1 476","1 194",null,null,null,null,"Trend, Titanium","Cool&Connect,","ST-Line",null,"Auch als 5-Türer","erhältlich"]
["Mercedes","C-Klasse","200 d",null,null,40470,null,null,4.8,"BENZIN",127,null,"6d",5,77,null,105,null,"M6","4 370","2 042","1 485","1 371","1.5 CDTI","(4.4,116,90,122)",null,null,"Edition, GS-Line,","Elegance, Ultimate"]
["Audi","A4 Limousine","30 TDI",null,null,36970,null,null,4.9000000000000004,"BENZIN",128,null,"6d-TEMP",5,85,null,115,null,"M6","4 313","1 785","1 426","1 360","35 TDI","(4.4,115,110,150)",null,null,"sport, design"]
["Ford","Mondeo","2.0l EcoBlue SCR",null,null,34100,null,null,4.9000000000000004,"BENZIN",128,null,"6d-TEMP",5,55,null,75,null,"M5","4 069","1 994","1 555","1 190","dCi 95","(4.4,116,70,95)",null,null,"Comfort, Stepway,","Celebration"]
["Peugeot",2008,"BlueHDi 100",null,null,25510,null,null,4.5,"BENZIN",118,null,"6d-TEMP-EVAP-ISC",5,70,null,95,null,"M6","4 378","1 825","1 454","1 363","1.5 EcoBlue","(4.5,117,88,120)","2.0 EcoBlue","(4.7,124,110,150)","Trend, Titanium","ST-Line, Vignale,","Active,","Cool&Connect","Auch als Turnier","erhältlich"]
["BMW","2er Active Tourer","216d",null,null,32050,null,null,4.7,"BENZIN",123,null,"6d-TEMP",5,85,null,115,null,"M6","4 359","2 058","1 447","1 315",null,null,null,null,"Life, Zen, Intens,","Edition One, RS Line"]
["Citroen","C3 Aircross","Blue HDi 100","S&S",null,20790,null,null,4.7,"BENZIN",123,null,"6d",5,85,null,115,null,"M6","4 319","1 799","1 434","1 375","118d","(4.7,122,11,150)"]
["Renault","Captur","Blue dCi 115",null,null,24890,null,null,4.7,"BENZIN",123,null,"6d-TEMP",5,75,null,102,null,"M6","4 170","1 979","1 480","1 148","BlueHDi 120","(5.0, 130, 88, 120)",null,null,"Feel, Shine"]
["Seat","Arona","1.6 TDI",null,null,19990,null,null,4.8,"BENZIN",125,null,"6d-TEMP-EVAP-ISC",5,88,null,120,null,"M6","4 186","1 930","1 536","1 280",null,null,null,null,"Titanium, ST-Line"]
["Fiat","500X Urban","1.6 MultiJet","95 SCR",null,22100,null,null,4.8,"BENZIN",126,null,"6d-TEMP-EVAP",5,85,null,115,null,"M6","4 340","1 795","1 455","1 313",null,null,null,null,"Level 2,3,4,5,6",null,null,null,"Auch als Combi","erhältlich"]
["Ford","EcoSport","1.5 l EcoBlue",null,null,23700,null,null,4.9000000000000004,"BENZIN",129,null,"6d-TEMP-EVAP-ISC",5,70,null,95,null,"M6","4 419","1 796","1 440","1 425","A180d","(4.5,118,85,116)","A200d","(4.8,125,110,150)"]
["Hyundai","Kona","1.6 CRDi",null,null,22690,null,null,5,"BENZIN",129,null,"6d-TEMP",5,75,null,102,null,"M6","4 253","2 043","1 457","1 205","1.5 BlueHDi 130","(4.5,119,96,131)",null,null,"Active, Allure, Access,","GT-Line, Style"]
["Mini","Countryman","One",null,null,28500,null,null,4.9000000000000004,"BENZIN",129,null,"6d",5,77,null,105,null,"M6","4 702","2 042","1 485","1 395","1.5 CDTI","(4.4,116,90,122)",null,null,"Astra, Edition,","GS Line, Elegance,","Ultimate"]
["Skoda","Kamiq","1.6l TDI ",null,null,24050,null,null,5,"BENZIN",131,null,"6d-TEMP-EVAP-ISC",5,85,null,116,null,"M6","4 689","1 994","1 468","1 370","2.0 TDI","(4.6,122,110,150)",null,null,"Business, Premium"]
["VW","T-Roc","1,6 TDI",null,null,25770,null,null,5.2,"BENZIN",136,null,"6d-TEMP-EVAP",5,85,null,116,null,"M6","4 585","2 039","1 465","1 370","1.6 CRDi","(4.6,120,100,136)",null,null,"Level 2,3,4,5,6"]
["Ford","Tourneo Courier","1.5 TDCi S&S",null,null,18142,null,null,5.4,"BENZIN",141,null,"6d-TEMP-EVAP-ISC",5,85,null,116,null,"M6","4 688","1 830","1 439","1 470","200d","(4.8,125,110,150)","220d","(4.8,127,140,190)"]
["Opel","Crossland X","1.5 CDTI",null,null,22349,null,null,4.7,"BENZIN",123,null,"6d-TEMP",5,85,null,116,null,"M6","4 626","2 058","1 449","1 315",null,null,null,null,"Limited, Intens,","Bose, GT-Line"]
["Dacia","Lodgy","Blue dCi 95",null,null,15350,null,null,4.8,"BENZIN",126,null,"6d-TEMP-EVAP-ISC",5,70,null,95,null,"M6","4 668","1 979","1 494","1 413","1.5 EcoBlue","(4.5,119,88,120)","2.0 EcoBlue","(4.7,124,110,150)","Trend, Titanium,","ST-Line, Vignale,","Active,","Cool&Connect"]
["BMW","2er Gran Tourer","216d",null,null,33600,null,null,4.9000000000000004,"BENZIN",128,null,"6d-TEMP-EVAP",5,70,null,95,null,"M5","4 571","1 792","1 514","1 395","MultiJet 120 SCR","(5.1,130,88,120)",null,null,"Street, Mirror,","Lounge, S-Design"]
["Dacia","Duster","Blue dCi 95",null,null,15490,null,null,4.9000000000000004,"BENZIN",128,null,"6d-TEMP",5,96,null,130,null,"M6","4 750","2 079","1 403","1 415","BlueHDI 160","(5.5,144,120,163),","BlueHDI 180","(5.7,150,130,177)","Active, Allure,","GT Line, GT",null,null,"Auch als Combi","erhältlich"]
["Citroen","C4 Spacetourer","BlueHDi 130","Start&Stop",null,28400,null,null,5,"BENZIN",130,null,"6d-TEMP",5,88,null,120,null,"M6","4 518","2 079","1 434","1 342",null,null,null,null,"Elegance, Executive,","S, Comfort"]
["Renault","Kadjar","Blue dCi 115",null,null,27090,null,null,5,"BENZIN",131,null,"6d-TEMP-EVAP",5,85,null,116,null,"M6","4 600","1 800","1 465","1 350","1.6 CRDi ISG","(4.8,125,100,136)",null,null,"Gold, Silber","Titan, Platin,","GT-Line"]
["Dacia","Dokker","Blue dCi 95",null,null,14250,null,null,5,"BENZIN",132,null,"6d-TEMP",5,90,null,122,null,"M6","4 897","2 093","1 455","1 503","2.0 CDTI","(4.7,122,128,174)",null,null,"Edition, Business","Elegance",null,null,"Auch als Combi","erhältlich"]
["Honda","HR-V","1.6 i-DTEC",null,null,25790,null,null,5,"BENZIN",132,null,"6d-TEMP",5,96,null,130,null,"M6","4 585","2 043","1 472","1 205",null,null,null,null,"Active, Allure,","GT Line, Access,","Style"]
["KIA","Sportage","1.6 CRDI SCR",null,null,31190,null,null,5.3,"BENZIN",135,null,"6d-TEMP-EVAP-ISC",5,110,null,150,null,"M6","4 775","2 083","1 483","1 525","1.6 TDI","(5.4,141,88,120)",null,null,"Business, Elegance",null,null,null,"Auch als Passat","Variant erhältlich"]
["DS Automobiles","DS 7","BlueHDi 130",null,null,41290,null,null,5.2,"BENZIN",136,null,"6d-TEMP",5,110,null,150,null,"M6","4 709","2 068","1 435","1 520","320d","(4.9,128,140,190)",null,null,null,null,null,null,"Auch als Combi","erhältlich"]
["Opel","Grandland X","1.5 CDTI",null,null,29309,null,null,5.2,"BENZIN",136,null,"6d-ISC-FCM",5,118,null,160,null,"M6","4 686","1 810","1 442","1 555","180d","(5.0,130,90,122)","220d","(5.0,132,143,194)",null,null,null,null,"Auch als Combi","erhältlich"]
["Peugeot",3008,"BlueHDi 130",null,null,33000,null,null,5.2,"BENZIN",136,null,"6d-TEMP",5,90,null,122,null,"M6","4 762","2 022","1 428","1 540","35 TDI","(5.0,131,120,163)","40 TDI","(5.2,136,140,190)","advanced, S line",null,null,null,"Auch als Combi","erhältlich"]
["VW","Golf Sportsvan","1.6 TDI",null,null,30120,null,null,5.2,"BENZIN",136,null,"6d-TEMP",5,88,null,120,null,"M6","4 871","2 121","1 482","1 707","2.0l EcoBlue","(5.0,131,110,150)","2.0l EcoBlue","(5.3,140,140,190)","Trend, Titanium,","ST-Line, Vignale"]
["Peugeot",5008,"BlueHDi 130",null,null,34900,null,null,5.3,"BENZIN",137,null,"6d-TEMP",5,75,null,100,null,"M6","4 300","1 987","1 530","1 205","BlueHDi 130","(4.9,129,96,130)",null,null,"Allure, Active,","GT-Line","Länge entspricht","Kompakt-Van"]
["Citroen","C5 Aircross","BlueHDi 130","Start&Stop",null,29390,null,null,5.2,"BENZIN",138,null,"6d",5,85,null,116,null,"M6","4 354","2 039","1 555","1 495","218d","(4.9,129,110,150)","220d","(5.1,134,140,190)",null,null,"Länge entspricht","Kompakt-Van"]
["Seat","Ateca","1.6 TDI",null,null,25880,null,null,5,"BENZIN",139,null,"6d-TEMP",5,75,null,102,null,"M6","4 154","1 976","1 597","1 292","Blue HDi 120","(5.2,137,88,120)",null,null,"Feel, Shine"]
["Citroen","C3","BlueHDi 100","Start&Stop",null,18290,null,null,4.5,"DIESEL",117,null,"6d-TEMP",5,85,null,115,null,"M6","4 227","2 003","1 576","1 490",null,null,null,null,"Life, Zen,","Intens, Edition One","Länge entspricht","Kompakt-Van"]
["Opel","Corsa","2021-05-01",null,null,"20 389",null,null,4.0999999999999996,"DIESEL",107,null,"6d-TEMP",5,70,null,95,null,"M5","4 138","1 942","1 543","1 297",null,null,null,null,"Reference, Style,","Xcellence"]
["VW","Golf","2.0 TDI",null,null,"29 390",null,null,4.0999999999999996,"DIESEL",107,null,"6d-TEMP-EVAP-ISC",5,70,null,95,null,"M5","4 264","2 025","1 595","1 320","1.6 MultiJet","(5.2,137,88,120)",null,null,"Lounge, Cross, Sport",null,"Länge entspricht","Kompakt-Van"]
["Peugeot",208,"BlueHDi 100","Start&Stop",null,"19 530",null,null,4.0999999999999996,"DIESEL",108,null,"6d-TEMP-EVAP-ISC",5,74,null,100,null,"M6","4 096","2 057","1 653","1 395","1.5 EcoBlue","(5.3,138,88,120)",null,null,"ST-Line, Titanium","Cool&Connect","Höhe entspricht","Kompakt-Van"]
["Renault","Clio","Blue dCi 85",null,null,"18 790",null,null,4.2,"DIESEL",109,null,"6d-TEMP-EVAP",5,85,null,116,null,"M6","4 165","2 070","1 550","1 318","1.6 CRDi","(5.1,134,100,136)",null,null,"Level 2,3,4,6"]
["Ford","Fiesta","1.5 TDCi","Start&Stop",null,"16 650",null,null,4.2,"DIESEL",111,null,"6d-TEMP",5,85,null,116,null,"M6","4 299","1 822","1 557","1 505","Cooper D","(5.0,130,110,150)","Cooper SD","(5.3,139,140,190)","One, Cooper",null,"Länge entspricht","Kompakt-Van"]
["Opel","Astra","1.5 CDTI",null,null,"23 739",null,null,4.3,"DIESEL",112,null,"6d-TEMP-EVAP-ISC",5,85,null,115,null,"M6","4 241","1 988","1 553","1 336",null,null,null,null,"Active, Ambition","Style, Monte Carlo"]
["Audi","A3 SB","30 TDI",null,null,"29 600",null,null,4.4000000000000004,"DIESEL",114,null,"6d-TEMP-EVAP-ISC",5,85,null,115,null,"M6","4 234","1 992","1 573","1 395","2,0 TDI","(5.4,141,110,150)",null,null,"T-Roc, Design, Sport"]
["Dacia","Sandero","Blue dCi 75","S&S",null,"11 340",null,null,4.4000000000000004,"DIESEL",116,null,"6d-TEMP-EVAP-ISC",5,55,null,75,null,"M6","4 157","2 112","1 741","1 420","1.5 TDCi SS","(5.5,144,74,101)",null,null,"Trend, Titanium, Sport",null,"Höhe entspricht","Kompakt-Van"]
["Ford","Focus","1.5 l EcoBlue",null,null,"23 650",null,null,4.5,"DIESEL",117]
["Renault","Megane","Blue dCi 115",null,null,"24 090",null,null,4.5,"DIESEL",117]
["BMW","1er Limousine","116d",null,null,"31 160",null,null,4.5,"DIESEL",118]
["Citroen","C4 Cactus","BlueHDi 100","S&S",null,"20 275",null,null,4.5,"DIESEL",118]
["Ford","Puma","1.5 l EcoBlue",null,null,"25 890",null,null,4.5,"DIESEL",118]
["Hyundai","i30","1.6 CRDi",null,null,"22 590",null,null,4.5999999999999996,"DIESEL",118]
["Mercedes","A-Klasse","160 d",null,null,"29 590",null,null,4.5,"DIESEL",118]
["Peugeot",308,"BlueHDi 100",null,null,"23 850",null,null,4.5,"DIESEL",118]
["Opel","Astra Sports Tourer","1.5 CDTI",null,null,"25 339",null,null,4.3,"DIESEL",113]
["Skoda","Octavia Combi","2.0 l TDI",null,null,"29 970",null,null,4.4000000000000004,"DIESEL",117]
["Hyundai","i30 CW","1.6 CRDi",null,null,"22 590",null,null,4.5,"DIESEL",118]
["Mercedes","CLA-Klasse","180 d",null,null,"35 460",null,null,4.5,"DIESEL",118]
["Renault","Megane Grandtour","Blue dCi 115",null,null,"25 090",null,null,4.5,"DIESEL",118]
["Ford","Focus Turnier","1.5 EcoBlue",null,null,"25 150",null,null,4.5,"DIESEL",119]
["Fiat","Tipo Kombi","MultiJet 95 SCR",null,null,"21 170",null,null,4.5999999999999996,"DIESEL",120]
["Peugeot",508,"BlueHDi 130",null,null,"36 750",null,null,4.7,"DIESEL",120]
["Honda","Civic","1.6i-DTEC",null,null,"24 390",null,null,4.5999999999999996,"DIESEL",121]
["KIA","ceed SW","1.6 CRDi ISG",null,null,"22 790",null,null,4.5999999999999996,"DIESEL",121]
["Opel","Insignia","1.5 CDTI",null,null,"32 699",null,null,4.5999999999999996,"DIESEL",121]
["Peugeot","308 SW","BlueHDi 130",null,null,"27 800",null,null,4.7,"DIESEL",122]
["VW","Passat Limousine","2.0 TDI",null,null,"36 659",null,null,4.7,"DIESEL",122]
["BMW","3er Limousine","318d",null,null,"38 950",null,null,4.8,"DIESEL",125]
["Mercedes","C-Klasse","200 d",null,null,"40 470",null,null,4.8,"DIESEL",127]
["Audi","A4 Limousine","30 TDI",null,null,"36 970",null,null,4.9000000000000004,"DIESEL",128]
["Ford","Mondeo","2.0l EcoBlue SCR",null,null,"34 100",null,null,4.9000000000000004,"DIESEL",128]
["Peugeot",2008,"BlueHDi 100",null,null,"25 510",null,null,4.5,"DIESEL",118]
["BMW","2er Active Tourer","216d",null,null,"32 050",null,null,4.7,"DIESEL",123]
["Citroen","C3 Aircross","Blue HDi 100","S&S",null,"20 790",null,null,4.7,"DIESEL",123]
["Renault","Captur","Blue dCi 115",null,null,"24 890",null,null,4.7,"DIESEL",123]
["Seat","Arona","1.6 TDI",null,null,"19 990",null,null,4.8,"DIESEL",125]
["Fiat","500X Urban","1.6 MultiJet","95 SCR",null,"22 100",null,null,4.8,"DIESEL",126]
["Ford","EcoSport","1.5 l EcoBlue",null,null,"23 700",null,null,4.9000000000000004,"DIESEL",129]
["Hyundai","Kona","1.6 CRDi",null,null,"22 690",null,null,5,"DIESEL",129]
["Mini","Countryman","One",null,null,"28 500",null,null,4.9000000000000004,"DIESEL",129]
["Skoda","Kamiq","1.6l TDI",null,null,"24 050",null,null,5,"DIESEL",131]
["VW","T-Roc","1,6 TDI",null,null,"25 770",null,null,5.2,"DIESEL",136]
["Ford","Tourneo Courier","1.5 TDCi S&S",null,null,"18 142",null,null,5.4,"DIESEL",141]

{"sheet":"Berechnungen","index":5,"n_rows":55,"n_cols":9,"rows_kept":55,"cut":false,"hidden":false,"merged":[[23,1,23,6]]}
[]
[null,"Jahre","Einnahmen","Ausgaben","Cash Flow","Barwerte","Kapitalwert","Zeit"]
[null,null,"[€]","[€]","[€]","[€]","[€]"]
[null,0,null,{"$f":"Eingabe!Q33*-1","v":4630},{"$f":"C4-D4","v":-4630},{"$f":"E4/(1+(Eingabe!G$73/100))^B4","v":-4630},{"$f":"F4","v":-4630},{"$f":"IF(G4<0,I4,0)","v":1},1]
[null,1,{"$f":"E27+Eingabe!$Q$49","v":992.78376842105286},{"$f":"Eingabe!$G$64+IF(Eingabe!$G$34=B5,Eingabe!$G$35,0)","v":0},{"$f":"(C5-D5)/(1+(Eingabe!$G$70/100))^B5","v":978.1120871143379},{"$f":"E5/(1+(Eingabe!G$73/100))^B5","v":963.65722868407681},{"$f":"G4+F5","v":-3666.3427713159231},{"$f":"IF(G5<0,I5,0)","v":2},2]
[null,2,{"$f":"E28+Eingabe!$Q$49","v":1002.4918849473686},{"$f":"Eingabe!$G$64+IF(Eingabe!$G$34=B6,Eingabe!$G$35,0)","v":0},{"$f":"(C6-D6)/(1+(Eingabe!$G$70/100))^B6","v":973.08052604758075},{"$f":"E6/(1+(Eingabe!G$73/100))^B6","v":944.53204498782407},-2721.810726328099,{"$f":"IF(G6<0,I6,0)","v":3},3]
[null,3,{"$f":"E29+Eingabe!$Q$49","v":1012.4304464215792},{"$f":"Eingabe!$G$64+IF(Eingabe!$G$34=B7,Eingabe!$G$35,0)","v":0},{"$f":"(C7-D7)/(1+(Eingabe!$G$70/100))^B7","v":968.20444089376861},{"$f":"E7/(1+(Eingabe!G$73/100))^B7","v":925.91036024223888},-1795.9003660858602,4,4]
[null,4,{"$f":"E30+Eingabe!$Q$49","v":1022.604605981903},{"$f":"Eingabe!$G$64+IF(Eingabe!$G$34=B8,Eingabe!$G$35,0)","v":0},{"$f":"(C8-D8)/(1+(Eingabe!$G$70/100))^B8","v":963.48193357471837},{"$f":"E8/(1+(Eingabe!G$73/100))^B8","v":907.77748398026097},-888.12288210559927,5,5]
[null,5,{"$f":"E31+Eingabe!$Q$49","v":1033.0196279929116},{"$f":"Eingabe!$G$64+IF(Eingabe!$G$34=B9,Eingabe!$G$35,0)","v":0},{"$f":"(C9-D9)/(1+(Eingabe!$G$70/100))^B9","v":958.9111360311133},{"$f":"E9/(1+(Eingabe!G$73/100))^B9","v":890.11916316733311},1.9962810617338391,0,6]
[null,6,{"$f":"E32+Eingabe!$Q$49","v":1043.6808903925109},{"$f":"Eingabe!$G$64+IF(Eingabe!$G$34=B10,Eingabe!$G$35,0)","v":0},{"$f":"(C10-D10)/(1+(Eingabe!$G$70/100))^B10","v":954.49020978857186},{"$f":"E10/(1+(Eingabe!G$73/100))^B10","v":872.92156919688421},874.91785025861805,0,7]
[null,7,{"$f":"E33+Eingabe!$Q$49","v":1054.5938870876982},{"$f":"Eingabe!$G$64+IF(Eingabe!$G$34=B11,Eingabe!$G$35,0)","v":0},{"$f":"(C11-D11)/(1+(Eingabe!$G$70/100))^B11","v":950.21734553017632},{"$f":"E11/(1+(Eingabe!G$73/100))^B11","v":856.17128527062073},1731.0891355292388,0,8]
[null,8,{"$f":"E34+Eingabe!$Q$49","v":1065.7642304000997},{"$f":"Eingabe!$G$64+IF(Eingabe!$G$34=B12,Eingabe!$G$35,0)","v":0},{"$f":"(C12-D12)/(1+(Eingabe!$G$70/100))^B12","v":946.09076267536705},{"$f":"E12/(1+(Eingabe!G$73/100))^B12","v":839.85529415228336},2570.9444296815223,0,9]
[null,9,{"$f":"E35+Eingabe!$Q$49","v":1077.1976535623085},{"$f":"Eingabe!$G$64+IF(Eingabe!$G$34=B13,Eingabe!$G$35,0)","v":2000},{"$f":"(C13-D13)/(1+(Eingabe!$G$70/100))^B13","v":-807.07577143092749},{"$f":"E13/(1+(Eingabe!G$73/100))^B13","v":-705.86220694531789},1865.0822227362044,0,10]
[null,10,{"$f":"E36+Eingabe!$Q$49","v":1088.9000132660749},{"$f":"Eingabe!$G$64+IF(Eingabe!$G$34=B14,Eingabe!$G$35,0)","v":0},{"$f":"(C14-D14)/(1+(Eingabe!$G$70/100))^B14","v":938.26946005322884},{"$f":"E14/(1+(Eingabe!G$73/100))^B14","v":808.4760482535346},2673.558270989739,0,11]
[null,11,{"$f":"E37+Eingabe!$Q$49","v":1100.8772922634039},{"$f":"Eingabe!$G$64+IF(Eingabe!$G$34=B15,Eingabe!$G$35,0)","v":0},{"$f":"(C15-D15)/(1+(Eingabe!$G$70/100))^B15","v":934.57131910386374},{"$f":"E15/(1+(Eingabe!G$73/100))^B15","v":793.38865160510034},3466.9469225948392,0,12]
[null,12,{"$f":"E38+Eingabe!$Q$49","v":1113.1356020216604},{"$f":"Eingabe!$G$64+IF(Eingabe!$G$34=B16,Eingabe!$G$35,0)","v":0},{"$f":"(C16-D16)/(1+(Eingabe!$G$70/100))^B16","v":931.01261639487666},{"$f":"E16/(1+(Eingabe!G$73/100))^B16","v":778.68724197859865},4245.6341645734374,0,13]
[null,"Summen",{"$f":"SUM(C5:C16)","v":12607.479902758572},{"$f":"SUM(D4:D16)","v":6630},{"$f":"SUM(E4:E16)","v":5059.3660657766759},{"$f":"SUM(F4:F16)","v":4245.6341645734374},null,{"$f":"IF(MAX(H4:H16)>12,\">12\",MAX(H4:H16))","v":5}]
[]
[]
[null,null,null,null,null,null,null,"Mehreinnahmen nach 12 Jahren:",{"$f":"NPV(Eingabe!G$73/100,Berechnungen!E5:E16)+E4","v":4245.6341645734374}]
[null,null,null,null,null,null,null,"Interner Zinsfuß:",{"$f":"IRR(F4:F16)","v":0.13725997248017086}]
[]
[]
[null,"Entwicklung Kraftstoffpreise"]
[null,"Jahre","Strom","Benzin-/Diesel","DELTA","Strom","Benzin-/Diesel"]
[null,null,"[€]","[€]","[€]","[€]","[€]"]
[null,1,{"$f":"Eingabe!$G$61*(1+(Eingabe!G$71/100))^B27","v":483.76823157894734},{"$f":"Eingabe!$M$61*(1+(Eingabe!G$72/100))^B27","v":848.2320000000002},{"$f":"D27-C27","v":364.46376842105286},{"$f":"C27/$C$27","v":1},{"$f":"D27/$D$27","v":1}]
[null,2,{"$f":"Eingabe!$G$61*(1+(Eingabe!G$71/100))^B28","v":491.02475505263146},{"$f":"Eingabe!$M$61*(1+(Eingabe!G$72/100))^B28","v":865.19664000000012},{"$f":"D28-C28","v":374.17188494736865},{"$f":"C28/$C$27","v":1.0149999999999999},{"$f":"D28/$D$27","v":1.0199999999999998}]
[null,3,{"$f":"Eingabe!$G$61*(1+(Eingabe!G$71/100))^B29","v":498.39012637842086},{"$f":"Eingabe!$M$61*(1+(Eingabe!G$72/100))^B29","v":882.5005728000001},384.11044642157924,1.0302249999999997,1.0403999999999998]
[null,4,{"$f":"Eingabe!$G$61*(1+(Eingabe!G$71/100))^B30","v":505.86597827409713},{"$f":"Eingabe!$M$61*(1+(Eingabe!G$72/100))^B30","v":900.15058425600012},394.28460598190298,1.0456783749999996,1.0612079999999999]
[null,5,{"$f":"Eingabe!$G$61*(1+(Eingabe!G$71/100))^B31","v":513.45396794820851},{"$f":"Eingabe!$M$61*(1+(Eingabe!G$72/100))^B31","v":918.15359594112022},404.6996279929117,1.0613635506249994,1.08243216]
[null,6,{"$f":"Eingabe!$G$61*(1+(Eingabe!G$71/100))^B32","v":521.15577746743156},{"$f":"Eingabe!$M$61*(1+(Eingabe!G$72/100))^B32","v":936.51666785994257},415.36089039251101,1.0772840038843743,1.1040808032]
[null,7,{"$f":"Eingabe!$G$61*(1+(Eingabe!G$71/100))^B33","v":528.97311412944293},{"$f":"Eingabe!$M$61*(1+(Eingabe!G$72/100))^B33","v":955.24700121714125},426.27388708769831,1.0934432639426397,1.1261624192639996]
[null,8,{"$f":"Eingabe!$G$61*(1+(Eingabe!G$71/100))^B34","v":536.90771084138453},{"$f":"Eingabe!$M$61*(1+(Eingabe!G$72/100))^B34","v":974.35194124148416},437.44423040009963,1.1098449129017791,1.1486856676492798]
[null,9,{"$f":"Eingabe!$G$61*(1+(Eingabe!G$71/100))^B35","v":544.96132650400523},{"$f":"Eingabe!$M$61*(1+(Eingabe!G$72/100))^B35","v":993.83898006631387},448.87765356230864,1.1264925865953057,1.1716593810022655]
[null,10,{"$f":"Eingabe!$G$61*(1+(Eingabe!G$71/100))^B36","v":553.13574640156526},{"$f":"Eingabe!$M$61*(1+(Eingabe!G$72/100))^B36","v":1013.7157596676402},460.58001326607496,1.1433899753942351,1.1950925686223108]
[null,11,{"$f":"Eingabe!$G$61*(1+(Eingabe!G$71/100))^B37","v":561.4327825975887},{"$f":"Eingabe!$M$61*(1+(Eingabe!G$72/100))^B37","v":1033.9900748609928},472.55729226340407,1.1605408250251485,1.2189944199947567]
[null,12,{"$f":"Eingabe!$G$61*(1+(Eingabe!G$71/100))^B38","v":569.85427433655229},{"$f":"Eingabe!$M$61*(1+(Eingabe!G$72/100))^B38","v":1054.6698763582128},484.81560202166054,1.1779489374005254,1.2433743083946522]
[]
[]
[]
[]
[]
[]
[]
[]
[]
[]
[]
[]
[]
[]
[]
[]
[null,null,null,null,"pes_"]

{"sheet":"Förderungen","index":6,"n_rows":112,"n_cols":20,"rows_kept":112,"cut":false,"hidden":true,"merged":[[5,2,5,3],[5,4,5,5],[21,10,21,15],[41,4,41,5],[41,2,41,3],[17,2,17,3],[17,4,17,5],[17,6,17,7],[29,2,29,3],[29,4,29,5],[9,10,9,15],[31,2,31,3],[32,2,32,3],[33,2,33,3],[34,2,34,3],[14,18,14,27],[41,6,41,7],[38,19,38,22],[4,18,4,27],[5,6,5,7],[33,10,33,15],[35,19,35,21],[45,10,45,15],[29,6,29,7],[107,10,107,15],[83,10,83,15],[95,10,95,15],[74,10,74,15],[103,2,103,3],[103,4,103,5],[103,6,103,7],[79,6,79,7],[57,10,57,15],[91,2,91,3],[91,4,91,5],[91,6,91,7],[79,2,79,3],[79,4,79,5],[71,10,71,15],[53,2,53,3],[53,4,53,5],[53,6,53,7],[67,2,67,3],[67,4,67,5],[67,6,67,7]]}
[]
[]
[null,"Gesamte Förderung:",null,null,null,null,null,null,null,"Landesförderungen:",null,null,null,null,null,null,null,null,"Bundesförderungen:"]
[]
[null,"Förderung für Burgenland",null,null,null,null,null,null,null,"Förderungen aktualisiert am 11.12.2013",null,null,null,null,null,null,null,null,"Klima- und Energiefonds Förderaktion Photovoltaik-Anlagen 2014"]
[null,null,"Anlagengröße",null,"Landesförderung",null,"Bundesförderung"]
[null,null,"","","Investition",null,"Investition","Tarif"]
[null,null,"1 - 3","kWp",300,"€/kWp",{"$f":"IF(H11<>0,200,IF(Eingabe!#REF!=Eingabe!C123,IF(Eingabe!#REF!=Eingabe!C175,275,IF(Eingabe!#REF!=Eingabe!C174,375,0)),0))","v":{"$error":"#REF!"}},"-"]
[null,null,4,"kWp",300,"€/kWp",{"$f":"$G$8","v":{"$error":"#REF!"}},"-",null,null,"Nähere Informationen zur Förderung:"]
[null,null,5,"kWp",300,"€/kWp",{"$f":"$G$8","v":{"$error":"#REF!"}},"-",null,null,"http://www.eabgld.at/index.php?id=986"]
[null,null,"> 5","kWp","-","-",{"$f":"IF(AND($G$8<275,H11<>0),200,0)","v":{"$error":"#REF!"}},{"$f":"IF(AND(Eingabe!#REF!>5,Eingabe!#REF!<=200,Eingabe!#REF!=Eingabe!C121),IF(AND(Eingabe!#REF!=Eingabe!$C$174,Eingabe!#REF!<=20,Eingabe!#REF!=Eingabe!$C$148),Eingabe!$W$182,IF(Eingabe!#REF!=Eingabe!$C$176,Eingabe!$P$191,Eingabe!$I$191)),0)","v":{"$error":"#REF!"}}]
[]
[null,"Information:"]
[null,{"$f":"Eingabe!P161","v":0}]
[]
[]
[null,"Förderung für Kärnten",null,null,null,null,null,null,null,"Förderungen aktualisiert am 11.12.2013"]
[null,null,"Anlagengröße",null,"Landesförderung",null,"Bundesförderung"]
[null,null,"","","Investition",null,"Investition","Tarif"]
[null,null,"1 - 3","kWp","-","-",{"$f":"$G$8","v":{"$error":"#REF!"}},"-"]
[null,null,4,"kWp","-","-",{"$f":"$G$8","v":{"$error":"#REF!"}},"-",null,null,"Nähere Informationen zur Förderung:"]
[null,null,5,"kWp","-","-",{"$f":"$G$8","v":{"$error":"#REF!"}},"-",null,null,"http://www.ktn.gv.at/42109_DE-ktn.gv.at-THEMEN?detail=2&thema=1&subthema="]
[null,null,"> 5","kWp","-","-",{"$f":"$G$11","v":{"$error":"#REF!"}},{"$f":"$H$11","v":{"$error":"#REF!"}}]
[]
[null,"Information:"]
[null,{"$f":"Eingabe!P162","v":0}]
[]
[]
[null,"Förderung für Niederösterreich",null,null,null,null,null,null,null,"Förderungen aktualisiert am 20.01.2015"]
[null,null,"Fahrzeug",null,"Landesförderung",null,"Bundesförderung"]
[null,null,"","","Investition",null,"Investition","Tarif"]
[null,null,"\"reines\" E-Fahrzeug",null,3000,"€",{"$f":"$G$8","v":{"$error":"#REF!"}},"-"]
[null,null,"Plug-In-Hybrid",null,1500,"€",{"$f":"$G$8","v":{"$error":"#REF!"}},"-",null,null,"Nähere Informationen zur Förderung:"]
[null,null,"e-Krafträder inkl. Leichtfahrzeuge",null,"-","-",{"$f":"$G$8","v":{"$error":"#REF!"}},"-",null,null,"http://www.ecoplus.at/de/ecoplus/cluster-niederoesterreich/e-mobil/foerderungen-fuer-e-fahrzeuge"]
[null,null,null,null,"-","-",{"$f":"$G$11","v":{"$error":"#REF!"}},{"$f":"$H$11","v":{"$error":"#REF!"}},null,null,null,null,null,null,null,null,null,null,null,"Zur Registrierung:"]
[null,null,null,null,null,null,null,null,null,null,null,null,null,null,null,null,null,null,null,"https://www.meinefoerderung.at/pv2014/"]
[null,"Information:"]
[null,{"$f":"Eingabe!P163","v":0},null,null,null,null,null,null,null,null,null,null,null,null,null,null,null,null,null,"Zum Leitfaden:"]
[null,null,null,null,null,null,null,null,null,null,null,null,null,null,null,null,null,null,null,"http://www.umweltfoerderung.at/uploads/leitfaden_pv.pdf"]
[]
[null,"Förderung für Oberösterreich",null,null,null,null,null,null,null,"Förderungen aktualisiert am 11.12.2013"]
[null,null,"Anlagengröße",null,"Landesförderung",null,"Bundesförderung"]
[null,null,"","","Investition",null,"Investition","Tarif"]
[null,null,"1 - 3","kWp","-","-",{"$f":"$G$8","v":{"$error":"#REF!"}},"-"]
[null,null,4,"kWp","-","-",{"$f":"$G$8","v":{"$error":"#REF!"}},"-",null,null,"Nähere Informationen zur Förderung:"]
[null,null,5,"kWp","-","-",{"$f":"$G$8","v":{"$error":"#REF!"}},"-",null,null,"http://www.esv.or.at/foerderungen/oekostrom/photovoltaik/"]
[null,null,"> 5","kWp","-","-",{"$f":"$G$11","v":{"$error":"#REF!"}},{"$f":"$H$11","v":{"$error":"#REF!"}}]
[]
[null,"Information:"]
[null,"Keine Förderung durch das Land Oberösterreich"]
[]
[]
[null,"Förderung für Salzburg",null,null,null,null,null,null,null,"Förderungen aktualisiert am 11.12.2013"]
[null,null,"Anlagengröße",null,"Landesförderung",null,"Bundesförderung"]
[null,null,"","","Investition",null,"Investition","Tarif"]
[null,null,"1 - 3","kWp",{"$f":"IF(Eingabe!#REF!<900,\"-\",Eingabe!W191)","v":{"$error":"#REF!"}},"€/kWp",{"$f":"$G$8","v":{"$error":"#REF!"}},"-"]
[null,null,4,"kWp","-","-",{"$f":"$G$8","v":{"$error":"#REF!"}},"-",null,null,"Nähere Informationen zur Förderung:"]
[null,null,5,"kWp","-","-",{"$f":"$G$8","v":{"$error":"#REF!"}},"-",null,null,"http://www.energieaktiv.at/information-und-beratung/foerdermoeglichkeiten/direktzuschuss/solar/fotovoltaik-oekostrom/?utm_source=wes&utm_medium=banner&utm_campaign=weitere+Informationen"]
[null,null,"> 5","kWp","-","-",{"$f":"$G$11","v":{"$error":"#REF!"}},{"$f":"$H$11","v":{"$error":"#REF!"}},null,"Außerdem gibt es folgende Förderung:"]
[null,null,null,null,null,null,null,null,null,"Kombination der PV-Anlage mit einer Wärmepumpe:"]
[null,"Information:",null,null,null,null,null,null,null,"Förderung erfolgt auf Basis eines Punktesystemes;"]
[null,{"$f":"Eingabe!P165","v":0},null,null,null,null,null,null,null,"für die Photovoltaikanlage erhält man maximal 40 Punkte; diese entsprechen 4.000 €"]
[null,null,null,null,null,null,null,null,null,"Die PV-Anlage muss jedoch mindestens 2 kWp groß sein!"]
[]
[null,"Gesamte Förderung:",null,null,null,null,null,null,null,"Landesförderungen:"]
[]
[null,"Förderung für Steiermark",null,null,null,null,null,null,null,"Förderungen aktualisiert am 11.12.2013"]
[null,null,"Anlagengröße",null,"Landesförderung",null,"Bundesförderung"]
[null,null,"","","Investition",null,"Investition","Tarif"]
[null,null,"1 - 3","kWp",{"$f":"IF(OR(Eingabe!$AE$231<2,Eingabe!#REF!<900),\"-\",Eingabe!$AE$232)","v":{"$error":"#REF!"}},{"$f":"IF(E70=\"-\",\"-\",\"€ für \"&Eingabe!$AE$231&\"kWp\")","v":{"$error":"#REF!"}},{"$f":"$G$8","v":{"$error":"#REF!"}},"-"]
[null,null,4,"kWp","-","-",{"$f":"$G$8","v":{"$error":"#REF!"}},"-",null,null,"Nähere Informationen zur Landesförderung:"]
[null,null,5,"kWp","-","-",{"$f":"$G$8","v":{"$error":"#REF!"}},"-",null,null,"http://www.technik.steiermark.at/cms/ziel/59689784/DE/"]
[null,null,"> 5","kWp","-","-",{"$f":"$G$11","v":{"$error":"#REF!"}},{"$f":"$H$11","v":{"$error":"#REF!"}}]
[null,null,null,null,null,null,null,null,null,null,"Nähere Informationen zu den Gemeindeförderungen:"]
[null,"Information:",null,null,null,null,null,null,null,null,"http://www.lev.at/index.asp?S=main/foerderungen/gemausw.asp&S1=left/left.asp"]
[null,{"$f":"Eingabe!P166","v":0}]
[]
[]
[null,"Förderung für Tirol",null,null,null,null,null,null,null,"Förderungen aktualisiert am 11.12.2013"]
[null,null,"Anlagengröße",null,"Landesförderung",null,"Bundesförderung"]
[null,null,"","","Investition",null,"Investition","Tarif"]
[null,null,"1 - 3","kWp","-","€/kWp",{"$f":"$G$8","v":{"$error":"#REF!"}},"-"]
[null,null,4,"kWp","-","€/kWp",{"$f":"$G$8","v":{"$error":"#REF!"}},"-",null,null,"Nähere Informationen zur Förderung:"]
[null,null,5,"kWp","-","€/kWp",{"$f":"$G$8","v":{"$error":"#REF!"}},"-",null,null,"https://www.tirol.gv.at/umwelt/energie/energiefoerderungen/"]
[null,null,"> 5","kWp","-","-",{"$f":"$G$11","v":{"$error":"#REF!"}},{"$f":"$H$11","v":{"$error":"#REF!"}}]
[]
[null,"Information:"]
[null,{"$f":"Eingabe!P167","v":0}]
[]
[]
[null,"Förderung für Vorarlberg",null,null,null,null,null,null,null,"Förderungen aktualisiert am 29.01.2014"]
[null,null,"Anlagengröße",null,"Landesförderung",null,"Bundesförderung"]
[null,null,"","","Investition",null,"Investition","Tarif"]
[null,null,"1 - 3","kWp","-","€/kWp",{"$f":"$G$8","v":{"$error":"#REF!"}},"-"]
[null,null,4,"kWp","-","€/kWp",{"$f":"$G$8","v":{"$error":"#REF!"}},"-",null,null,"Nähere Informationen zur Förderung:"]
[null,null,5,"kWp","-","€/kWp",{"$f":"$G$8","v":{"$error":"#REF!"}},"-",null,null,"http://www.vorarlberg.at/vorarlberg/wasser_energie/energie/energie/foerderungen/sub/foerderungvonphotovoltaik.htm"]
[null,null,"> 5","kWp","-","-",{"$f":"$G$11","v":{"$error":"#REF!"}},{"$f":"$H$11","v":{"$error":"#REF!"}}]
[]
[null,"Information:"]
[null,{"$f":"Eingabe!P168","v":0}]
[]
[]
[null,"Förderung für Wien",null,null,null,null,null,null,null,"Förderungen aktualisiert am 11.12.2013"]
[null,null,"Anlagengröße",null,"Landesförderung",null,"Bundesförderung"]
[null,null,"","","Investition",null,"Investition","Tarif"]
[null,null,"1 - 3","kWp",275,"€/kWp",{"$f":"$G$8","v":{"$error":"#REF!"}},"-"]
[null,null,4,"kWp",275,"€/kWp",{"$f":"$G$8","v":{"$error":"#REF!"}},"-",null,null,"Nähere Informationen zur Förderung:"]
[null,null,5,"kWp",275,"€/kWp",{"$f":"$G$8","v":{"$error":"#REF!"}},"-",null,null,"http://www.umweltfoerderung.at/kpc/de/home/umweltfrderung/fr_private/weitere_frderungen/landesfrderung_wien/"]
[null,null,"> 5","kWp",400,"€/kWp",{"$f":"$G$11","v":{"$error":"#REF!"}},{"$f":"$H$11","v":{"$error":"#REF!"}}]
[]
[null,"Information:"]
[null,{"$f":"Eingabe!P169","v":0}]

{"sheet":"Wetterdaten","index":7,"n_rows":54,"n_cols":13,"rows_kept":54,"cut":false,"hidden":true,"merged":[]}
["Ort","PLZ","Land","PLZ-Differenz","Jährliche Einstrahlung","mittlere Aussentemperatur","Längengrad","Breitengrad","Ermittlung der Einstrahlung"]
[null,null,null,null,"[kWh/m²a]","[°C]","[°]","[°]"]
["Admont",8911,"AUT",{"$f":"IF(B3>$L$3,B3-$L$3,$L$3-B3)","v":{"$error":"#VALUE!"}},1028.32,"    5.86","-14.45"," 47.57",{"$f":"IF($L$4=D3,E3,0)","v":{"$error":"#VALUE!"}},{"$f":"IF(I3=0,0,1)","v":{"$error":"#VALUE!"}},"PLZ:",{"$f":"Eingabe!M12","v":"VW Golf - Benzin"}]
["Amstetten",3300,"AUT",{"$error":"#VALUE!"},1069.0999999999999,"    8.79","-14.83"," 48.08",{"$error":"#VALUE!"},{"$f":"IF(I4=0,0,1)","v":{"$error":"#VALUE!"}},"Diff:",{"$f":"MIN(D3:D53)","v":{"$error":"#VALUE!"}}]
["Arriach",9543,"AUT",{"$error":"#VALUE!"},1144.54,"    6.46","-13.85"," 46.72",{"$error":"#VALUE!"},{"$error":"#VALUE!"},"Einstrahlung",{"$f":"ROUNDDOWN(K54,-0.5)","v":{"$error":"#VALUE!"}},"kWh/m²a"]
["Bad Gleichenberg",8344,"AUT",{"$error":"#VALUE!"},1153.19,"    9.14","-15.88"," 46.87",{"$error":"#VALUE!"},{"$error":"#VALUE!"}]
["Bad Ischl",4820,"AUT",{"$error":"#VALUE!"},1093.31,"    7.90","-13.60"," 47.72",{"$error":"#VALUE!"},{"$error":"#VALUE!"}]
["Bludenz",6700,"AUT",{"$error":"#VALUE!"},1079.79,"    7.97"," -9.82"," 48.50",{"$error":"#VALUE!"},{"$error":"#VALUE!"}]
["Bruck an der Mur",8600,"AUT",{"$error":"#VALUE!"},1070.77,"    8.07","-15.25"," 47.42",{"$error":"#VALUE!"},{"$error":"#VALUE!"}]
["Eisenerz",8790,"AUT",{"$error":"#VALUE!"},1071.43,"    7.11","-14.88"," 47.53",{"$error":"#VALUE!"},{"$error":"#VALUE!"}]
["Eisenstadt",7000,"AUT",{"$error":"#VALUE!"},1132.17,"   10.01","-16.68"," 47.90",{"$error":"#VALUE!"},{"$error":"#VALUE!"}]
["Feldkirch",6800,"AUT",{"$error":"#VALUE!"},1100.3800000000001,"    8.30"," -9.58"," 47.23",{"$error":"#VALUE!"},{"$error":"#VALUE!"}]
["Ferlach",9170,"AUT",{"$error":"#VALUE!"},1156.25,"    7.82","-14.28"," 46.52",{"$error":"#VALUE!"},{"$error":"#VALUE!"}]
["Fresach ",9712,"AUT",{"$error":"#VALUE!"},1207.3599999999999,"    7.07","-13.68"," 46.70",{"$error":"#VALUE!"},{"$error":"#VALUE!"}]
["Gargellen",6787,"AUT",{"$error":"#VALUE!"},1174.51,"    4.42"," -9.92"," 46.97",{"$error":"#VALUE!"},{"$error":"#VALUE!"}]
["Gmunden",4810,"AUT",{"$error":"#VALUE!"},1088.42,"    8.57","-13.80"," 47.92",{"$error":"#VALUE!"},{"$error":"#VALUE!"}]
["Graz",8010,"AUT",{"$error":"#VALUE!"},1126.02,"    9.17","-15.42"," 47.67",{"$error":"#VALUE!"},{"$error":"#VALUE!"}]
["Gumpoldskirchen",2352,"AUT",{"$error":"#VALUE!"},1125.22,"    9.11","-16.27"," 48.33",{"$error":"#VALUE!"},{"$error":"#VALUE!"}]
["Hallstadt",4830,"AUT",{"$error":"#VALUE!"},1054.8,"    8.00","-13.63"," 47.55",{"$error":"#VALUE!"},{"$error":"#VALUE!"}]
["Imst",6460,"AUT",{"$error":"#VALUE!"},1069.1099999999999,"    7.31","-10.72"," 47.23",{"$error":"#VALUE!"},{"$error":"#VALUE!"}]
["Innsbruck",6020,"AUT",{"$error":"#VALUE!"},1089.72,"    8.61","-11.40"," 47.27",{"$error":"#VALUE!"},{"$error":"#VALUE!"}]
["Kitzbuehl",6370,"AUT",{"$error":"#VALUE!"},1069.8800000000001,"    6.19","-12.38"," 47.45",{"$error":"#VALUE!"},{"$error":"#VALUE!"}]
["Klagenfurt",9010,"AUT",{"$error":"#VALUE!"},1131,"    8.14","-14.30"," 46.62",{"$error":"#VALUE!"},{"$error":"#VALUE!"}]
["Krems a. d. Donau",3500,"AUT",{"$error":"#VALUE!"},1071.4000000000001,"    9.62","-15.58"," 48.50",{"$error":"#VALUE!"},{"$error":"#VALUE!"}]
["Kremsmünster",4550,"AUT",{"$error":"#VALUE!"},1046.5,"    7.69","-14.12"," 48.05",{"$error":"#VALUE!"},{"$error":"#VALUE!"}]
["Leoben",8700,"AUT",{"$error":"#VALUE!"},1068.49,"    8.30","-15.83"," 47.37",{"$error":"#VALUE!"},{"$error":"#VALUE!"}]
["Lienz",9900,"AUT",{"$error":"#VALUE!"},1147.74,"    7.41","-12.80"," 46.83",{"$error":"#VALUE!"},{"$error":"#VALUE!"}]
["Lilienfeld",3180,"AUT",{"$error":"#VALUE!"},1075.26,"    8.36","-15.62"," 48.17",{"$error":"#VALUE!"},{"$error":"#VALUE!"}]
["Millstatt",9872,"AUT",{"$error":"#VALUE!"},1189.53,"    8.67","-13.57"," 46.80",{"$error":"#VALUE!"},{"$error":"#VALUE!"}]
["Mondsee",5310,"AUT",{"$error":"#VALUE!"},1046.56,"    7.84","-13.33"," 47.85",{"$error":"#VALUE!"},{"$error":"#VALUE!"}]
["Mönichkirchen",2872,"AUT",{"$error":"#VALUE!"},1083.3,"    6.25","-16.17"," 47.50",{"$error":"#VALUE!"},{"$error":"#VALUE!"}]
["Nauders",6543,"AUT",{"$error":"#VALUE!"},1201.4100000000001,"    4.71","-10.50"," 46.88",{"$error":"#VALUE!"},{"$error":"#VALUE!"}]
["Neumarkt in der Steiermark",8820,"AUT",{"$error":"#VALUE!"},1161.95,"    6.39","-14.42"," 47.67",{"$error":"#VALUE!"},{"$error":"#VALUE!"}]
["Obervellach",9821,"AUT",{"$error":"#VALUE!"},1226.7,"    8.44","-13.20"," 46.93",{"$error":"#VALUE!"},{"$error":"#VALUE!"}]
["Oberwölz Stadt",8832,"AUT",{"$f":"IF(B35>$L$3,B35-$L$3,$L$3-B35)","v":{"$error":"#VALUE!"}},1107.8499999999999,"    6.20","-14.27"," 47.20",{"$f":"IF($L$4=D35,E35,0)","v":{"$error":"#VALUE!"}},{"$error":"#VALUE!"}]
["Radentheim",9545,"AUT",{"$error":"#VALUE!"},1133.1199999999999,"    7.53","-13.70"," 46.80",{"$error":"#VALUE!"},{"$error":"#VALUE!"}]
["Ramsau Dachstein",8972,"AUT",{"$error":"#VALUE!"},1129.03,"    5.16","-12.88"," 47.60",{"$error":"#VALUE!"},{"$error":"#VALUE!"}]
["Rauris",5661,"AUT",{"$error":"#VALUE!"},1124.1500000000001,"    5.82","-12.98"," 47.23",{"$error":"#VALUE!"},{"$error":"#VALUE!"}]
["Reichersberg",4981,"AUT",{"$error":"#VALUE!"},1037.3699999999999,"    8.48","-13.37"," 48.33",{"$error":"#VALUE!"},{"$error":"#VALUE!"}]
["Reichraming",4462,"AUT",{"$error":"#VALUE!"},1068.82,"    8.13","-14.45"," 47.88",{"$error":"#VALUE!"},{"$error":"#VALUE!"}]
["Salzburg",5020,"AUT",{"$error":"#VALUE!"},1113.6099999999999,"    8.39","-13.33"," 47.82",{"$error":"#VALUE!"},{"$error":"#VALUE!"}]
["St. Lorenzen im Lesachtal",9654,"AUT",{"$error":"#VALUE!"},1217.1300000000001,"    5.73"," 12.77"," 46.70",{"$error":"#VALUE!"},{"$error":"#VALUE!"}]
["St. Michael i. Lundgau",5582,"AUT",{"$error":"#VALUE!"},1194.76,"    6.55","-13.48"," 47.83",{"$error":"#VALUE!"},{"$error":"#VALUE!"}]
["St. Pölten",3100,"AUT",{"$error":"#VALUE!"},1031.18,"    8.59","-15.60"," 48.20",{"$error":"#VALUE!"},{"$error":"#VALUE!"}]
["Velden am Wörtersee",9220,"AUT",{"$error":"#VALUE!"},1189.4000000000001,"    8.04","-14.33"," 46.62",{"$error":"#VALUE!"},{"$error":"#VALUE!"}]
["Villach",9500,"AUT",{"$error":"#VALUE!"},1188.95,"    8.04","-13.83"," 46.62",{"$error":"#VALUE!"},{"$error":"#VALUE!"}]
["Wels",4600,"AUT",{"$error":"#VALUE!"},1036.5,"    8.67","-14.17"," 48.17",{"$error":"#VALUE!"},{"$error":"#VALUE!"}]
["Weyer Mark",3335,"AUT",{"$error":"#VALUE!"},1106.53,"    7.58","-14.65"," 47.85",{"$error":"#VALUE!"},{"$error":"#VALUE!"}]
["Wien",1190,"AUT",{"$error":"#VALUE!"},1084.48,"    9.77","-16.33"," 48.20",{"$error":"#VALUE!"},{"$error":"#VALUE!"}]
["Wiener Neustadt",2700,"AUT",{"$error":"#VALUE!"},1080.56,"    9.44","-16.23"," 47.82",{"$error":"#VALUE!"},{"$error":"#VALUE!"}]
["Wolfsberg",9400,"AUT",{"$error":"#VALUE!"},1066.68,"    7.86","-14.83"," 46.85",{"$error":"#VALUE!"},{"$error":"#VALUE!"}]
["Zell am See",5700,"AUT",{"$error":"#VALUE!"},1080.32,"    6.55","-12.77"," 47.32",{"$error":"#VALUE!"},{"$error":"#VALUE!"}]
["Zwettl",3910,"AUT",{"$error":"#VALUE!"},1051.52,"    5.71","-15.15"," 48.58",{"$error":"#VALUE!"},{"$error":"#VALUE!"}]
[null,null,null,null,null,null,null,"Einstrahlungswert:",{"$f":"SUM(I3:I53)","v":{"$error":"#VALUE!"}},{"$f":"SUM(J3:J53)","v":{"$error":"#VALUE!"}},{"$f":"I54/J54","v":{"$error":"#VALUE!"}}]

{"sheet":"PLZ-Zuordnung","index":8,"n_rows":2460,"n_cols":10,"rows_kept":2460,"cut":false,"hidden":true,"merged":[]}
["PLZ","Ort","Bundesland","NamePLZTyp","intern_extern","adressierbar","Postfach"]
[null,null,null,null,null,null,null,null,"Zuordnung der PLZ und des Ortes (Bundesland):"]
[1004,"Wien","W","InteressentenPLZ","extern","Nein","Ja",null,{"$f":"Eingabe!M12","v":"VW Golf - Benzin"},{"$f":"VLOOKUP(I3,A3:C2460,3,TRUE)","v":{"$error":"#N/A"}}]
[1010,"Wien","W","PLZ-Adressierung","extern","Ja","Ja",null,null,{"$f":"VLOOKUP(J3,I7:J15,2,TRUE)","v":{"$error":"#N/A"}}]
[1011,"Wien Postfach","W","PLZ-Postfach","extern","Nein","Ja",null,null,{"$f":"VLOOKUP(I3,A3:C2460,2,FALSE)","v":{"$error":"#N/A"}}]
[1012,"Wien","W","PLZ-Postfach","extern","Nein","Ja"]
[1013,"Wien","W","PLZ-Postfach","extern","Nein","Ja",null,"B","Burgenland"]
[1014,"Wien","W","PLZ-Postfach","extern","Nein","Ja",null,"K","Kärnten"]
[1015,"Wien","W","PLZ-Postfach","extern","Nein","Ja",null,"N","Niederösterreich"]
[1016,"Wien","W","PLZ-Postfach","extern","Nein","Ja",null,"O","Oberösterreich"]
[1017,"Wien-Parlament","W","PLZ-Postfach","extern","Nein","Ja",null,"Sa","Salzburg"]
[1018,"Wien","W","PLZ-Postfach","extern","Nein","Ja",null,"St","Steiermark"]
[1020,"Wien","W","PLZ-Adressierung","extern","Ja","Ja",null,"T","Tirol"]
[1021,"Wien Postfach","W","PLZ-Postfach","extern","Nein","Ja",null,"V","Vorarlberg"]
[1022,"Wien","W","PLZ-Postfach","extern","Nein","Ja",null,"W","Wien"]
[1023,"Wien","W","PLZ-Postfach","extern","Nein","Ja"]
[1024,"Wien","W","PLZ-Postfach","extern","Nein","Ja"]
[1025,"Wien","W","PLZ-Postfach","extern","Nein","Ja"]
[1029,"Wien","W","InteressentenPLZ","extern","Nein","Ja"]
[1030,"Wien","W","PLZ-Adressierung","extern","Ja","Ja"]
[1031,"Wien Postfach","W","PLZ-Postfach","extern","Nein","Ja"]
[1033,"Wien","W","PLZ-Postfach","extern","Nein","Ja"]
[1034,"Wien","W","PLZ-Postfach","extern","Nein","Ja"]
[1035,"Wien","W","PLZ-Postfach","extern","Nein","Ja"]
[1036,"Wien","W","PLZ-Postfach","extern","Nein","Ja"]
[1037,"Wien","W","PLZ-Postfach","extern","Nein","Ja"]
[1038,"Wien","W","InteressentenPLZ","extern","Nein","Ja"]
[1039,"Wien","W","InteressentenPLZ","extern","Nein","Ja"]
[1040,"Wien","W","PLZ-Adressierung","extern","Ja","Ja"]
[1041,"Wien Postfach","W","PLZ-Postfach","extern","Nein","Ja"]
[1042,"Wien","W","PLZ-Postfach","extern","Nein","Ja"]
[1043,"Wien","W","PLZ-Postfach","extern","Nein","Ja"]
[1045,"Wien","W","InteressentenPLZ","extern","Nein","Ja"]
[1050,"Wien","W","PLZ-Adressierung","extern","Ja","Ja"]
[1051,"Wien Postfach","W","PLZ-Postfach","extern","Nein","Ja"]
[1052,"Wien","W","PLZ-Postfach","extern","Nein","Ja"]
[1053,"Wien","W","PLZ-Postfach","extern","Nein","Ja"]
[1060,"Wien","W","PLZ-Adressierung","extern","Ja","Ja"]
[1061,"Wien Postfach","W","PLZ-Postfach","extern","Nein","Ja"]
[1062,"Wien","W","PLZ-Postfach","extern","Nein","Ja"]
[1063,"Wien-VÖPh","W","InteressentenPLZ","extern","Nein","Ja"]
[1070,"Wien","W","PLZ-Adressierung","extern","Ja","Ja"]
[1071,"Wien Postfach","W","PLZ-Postfach","extern","Nein","Ja"]
[1072,"Wien","W","PLZ-Postfach","extern","Nein","Ja"]
[1080,"Wien","W","PLZ-Adressierung","extern","Ja","Ja"]
[1081,"Wien Postfach","W","PLZ-Postfach","extern","Nein","Ja"]
[1082,"Wien","W","PLZ-Postfach","extern","Nein","Ja"]
[1090,"Wien","W","PLZ-Adressierung","extern","Ja","Ja"]
[1091,"Wien Postfach","W","PLZ-Postfach","extern","Nein","Ja"]
[1092,"Wien","W","PLZ-Postfach","extern","Nein","Ja"]
[1093,"Wien","W","PLZ-Postfach","extern","Nein","Ja"]
[1094,"Wien","W","PLZ-Postfach","extern","Nein","Ja"]
[1095,"Wien","W","PLZ-Postfach","extern","Nein","Ja"]
[1096,"Wien","W","PLZ-Postfach","extern","Nein","Ja"]
[1097,"Wien","W","PLZ-Postfach","extern","Nein","Ja"]
[1100,"Wien","W","PLZ-Adressierung","extern","Ja","Ja"]
[1101,"Wien Postfach","W","PLZ-Postfach","extern","Nein","Ja"]
[1102,"Wien","W","PLZ-Postfach","extern","Nein","Ja"]
[1103,"Wien","W","PLZ-Postfach","extern","Nein","Ja"]
[1104,"Wien","W","PLZ-Postfach","extern","Nein","Ja"]
[1105,"Wien","W","PLZ-Postfach","extern","Nein","Ja"]
[1106,"Wien","W","PLZ-Postfach","extern","Nein","Ja"]
[1107,"Wien","W","PLZ-Postfach","extern","Nein","Ja"]
[1108,"Wien","W","PLZ-Postfach","extern","Nein","Ja"]
[1109,"Wien","W","PLZ-Postfach","extern","Nein","Ja"]
[1110,"Wien","W","PLZ-Adressierung","extern","Ja","Ja"]
[1111,"Wien Postfach","W","PLZ-Postfach","extern","Nein","Ja"]
[1112,"Wien","W","PLZ-Postfach","extern","Nein","Ja"]
[1113,"Wien","W","PLZ-Postfach","extern","Nein","Ja"]
[1120,"Wien","W","PLZ-Adressierung","extern","Ja","Ja"]
[1121,"Wien Postfach","W","PLZ-Postfach","extern","Nein","Ja"]
[1122,"Wien","W","PLZ-Postfach","extern","Nein","Ja"]
[1125,"Wien","W","PLZ-Postfach","extern","Nein","Ja"]
[1126,"Wien","W","PLZ-Postfach","extern","Nein","Ja"]
[1127,"Wien","W","PLZ-Postfach","extern","Nein","Ja"]
[1130,"Wien","W","PLZ-Adressierung","extern","Ja","Ja"]
[1131,"Wien Postfach","W","PLZ-Postfach","extern","Nein","Ja"]
[1132,"Wien","W","PLZ-Postfach","extern","Nein","Ja"]
[1133,"Wien","W","PLZ-Postfach","extern","Nein","Ja"]
[1134,"Wien","W","PLZ-Postfach","extern","Nein","Ja"]
[1136,"Wien","W","InteressentenPLZ","extern","Nein","Ja"]
[1140,"Wien","W","PLZ-Adressierung","extern","Ja","Ja"]
[1141,"Wien Postfach","W","PLZ-Postfach","extern","Nein","Ja"]
[1142,"Wien","W","PLZ-Postfach","extern","Nein","Ja"]
[1143,"Wien","W","PLZ-Postfach","extern","Nein","Ja"]
[1144,"Wien","W","PLZ-Postfach","extern","Nein","Ja"]
[1145,"Wien","W","PLZ-Postfach","extern","Nein","Ja"]
[1147,"Wien","W","PLZ-Postfach","extern","Nein","Ja"]
[1148,"Wien","W","InteressentenPLZ","extern","Nein","Ja"]
[1150,"Wien","W","PLZ-Adressierung","extern","Ja","Ja"]
[1151,"Wien Postfach","W","PLZ-Postfach","extern","Nein","Ja"]
[1152,"Wien","W","PLZ-Postfach","extern","Nein","Ja"]
[1153,"Wien","W","PLZ-Postfach","extern","Nein","Ja"]
[1160,"Wien","W","PLZ-Adressierung","extern","Ja","Ja"]
[1161,"Wien Postfach","W","PLZ-Postfach","extern","Nein","Ja"]
[1163,"Wien","W","PLZ-Postfach","extern","Nein","Ja"]
[1165,"Wien","W","PLZ-Postfach","extern","Nein","Ja"]
[1166,"Wien","W","PLZ-Postfach","extern","Nein","Ja"]
[1170,"Wien","W","PLZ-Adressierung","extern","Ja","Ja"]
[1171,"Wien Postfach","W","PLZ-Postfach","extern","Nein","Ja"]
[1172,"Wien","W","PLZ-Postfach","extern","Nein","Ja"]
[1173,"Wien","W","PLZ-Postfach","extern","Nein","Ja"]
[1180,"Wien","W","PLZ-Adressierung","extern","Ja","Ja"]
[1181,"Wien Postfach","W","PLZ-Postfach","extern","Nein","Ja"]
[1182,"Wien","W","PLZ-Postfach","extern","Nein","Ja"]
[1183,"Wien","W","PLZ-Postfach","extern","Nein","Ja"]
[1190,"Wien","W","PLZ-Adressierung","extern","Ja","Ja"]
[1191,"Wien Postfach","W","PLZ-Postfach","extern","Nein","Ja"]
[1192,"Wien","W","PLZ-Postfach","extern","Nein","Ja"]
[1193,"Wien","W","PLZ-Postfach","extern","Nein","Ja"]
[1194,"Wien","W","PLZ-Postfach","extern","Nein","Ja"]
[1195,"Wien","W","PLZ-Postfach","extern","Nein","Ja"]
[1196,"Wien","W","PLZ-Postfach","extern","Nein","Ja"]
[1200,"Wien","W","PLZ-Adressierung","extern","Ja","Ja"]
[1201,"Wien Postfach","W","PLZ-Postfach","extern","Nein","Ja"]
[1202,"Wien","W","PLZ-Postfach","extern","Nein","Ja"]
[1203,"Wien","W","PLZ-Postfach","extern","Nein","Ja"]
[1204,"Wien","W","PLZ-Postfach","extern","Nein","Ja"]
[1205,"Wien","W","PLZ-Postfach","extern","Nein","Ja"]
[1206,"Wien","W","PLZ-Postfach","extern","Nein","Ja"]
[1210,"Wien","W","PLZ-Adressierung","extern","Ja","Ja"]
[1211,"Wien Postfach","W","PLZ-Postfach","extern","Nein","Ja"]
[1212,"Wien","W","PLZ-Postfach","extern","Nein","Ja"]
[1213,"Wien","W","PLZ-Postfach","extern","Nein","Ja"]
[1214,"Wien","W","PLZ-Postfach","extern","Nein","Ja"]
[1215,"Wien","W","PLZ-Postfach","extern","Nein","Ja"]
[1216,"Wien","W","PLZ-Postfach","extern","Nein","Ja"]
[1217,"Wien","W","PLZ-Postfach","extern","Nein","Ja"]
[1218,"Wien","W","PLZ-Postfach","extern","Nein","Ja"]
[1220,"Wien","W","PLZ-Adressierung","extern","Ja","Ja"]
[1221,"Wien Postfach","W","PLZ-Postfach","extern","Nein","Ja"]
[1222,"Wien","W","PLZ-Postfach","extern","Nein","Ja"]
[1223,"Wien","W","PLZ-Postfach","extern","Nein","Ja"]
[1224,"Wien","W","PLZ-Postfach","extern","Nein","Ja"]
[1225,"Wien","W","PLZ-Postfach","extern","Nein","Ja"]
[1226,"Wien","W","PLZ-Postfach","extern","Nein","Ja"]
[1228,"Wien","W","PLZ-Postfach","extern","Nein","Ja"]
[1229,"Wien","W","PLZ-Postfach","extern","Nein","Ja"]
[1230,"Wien","W","PLZ-Adressierung","extern","Ja","Ja"]
[1231,"Wien Postfach","W","PLZ-Postfach","extern","Nein","Ja"]
[1232,"Wien","W","PLZ-Postfach","extern","Nein","Ja"]
[1233,"Wien","W","PLZ-Postfach","extern","Nein","Ja"]
[1234,"Wien","W","PLZ-Postfach","extern","Nein","Ja"]
[1235,"Wien","W","PLZ-Postfach","extern","Nein","Ja"]
[1236,"Wien","W","PLZ-Postfach","extern","Nein","Ja"]
[1238,"Wien","W","PLZ-Postfach","extern","Nein","Ja"]
[1239,"Wien","W","PLZ-Postfach","extern","Nein","Ja"]
[1300,"Wien-Flughafen","W","PLZ-Adressierung","extern","Ja","Ja"]
[1400,"Wien-Vereinte Nationen","W","PLZ-Postfach","extern","Nein","Ja"]
[1402,"Wien","W","PLZ-Postfach","extern","Nein","Ja"]
[1423,"Wien","W","PLZ-Postfach","extern","Nein","Ja"]
[1500,"UNDOF AUSBATT","W","FeldPLZ","extern","Nein","Ja"]
[1502,"AUCON EUFOR","W","FeldPLZ","extern","Nein","Ja"]
[1503,"AUCON KFOR","W","FeldPLZ","extern","Nein","Ja"]
[1600,"Wien","W","InteressentenPLZ","extern","Nein","Ja"]
[2000,"Stockerau","N","PLZ-Adressierung","extern","Ja","Ja"]
[2002,"Großmugl","N","PLZ-Adressierung","extern","Ja","Nein"]
[2003,"Leitzersdorf","N","PLZ-Adressierung","extern","Ja","Nein"]
[2004,"Niederhollabrunn","N","PLZ-Adressierung","extern","Ja","Nein"]
[2011,"Sierndorf","N","PLZ-Adressierung","extern","Ja","Nein"]
[2013,"Göllersdorf","N","PLZ-Adressierung","extern","Ja","Nein"]
[2014,"Breitenwaida","N","PLZ-Adressierung","extern","Ja","Nein"]
[2020,"Hollabrunn","N","PLZ-Adressierung","extern","Ja","Ja"]
[2022,"Immendorf","N","PLZ-Adressierung","extern","Ja","Nein"]
[2023,"Nappersdorf","N","PLZ-Adressierung","extern","Ja","Ja"]
[2024,"Mailberg","N","PLZ-Adressierung","extern","Ja","Nein"]
[2031,"Eggendorf im Thale","N","PLZ-Adressierung","extern","Ja","Nein"]
[2032,"Enzersdorf im Thale","N","PLZ-Adressierung","extern","Ja","Nein"]
[2033,"Kammersdorf","N","PLZ-Adressierung","extern","Ja","Nein"]
[2034,"Großharras","N","PLZ-Adressierung","extern","Ja","Ja"]
[2041,"Wullersdorf","N","PLZ-Adressierung","extern","Ja","Ja"]
[2042,"Guntersdorf","N","PLZ-Adressierung","extern","Ja","Nein"]
[2051,"Zellerndorf","N","PLZ-Adressierung","extern","Ja","Ja"]
[2052,"Pernersdorf-Pfaffendorf","N","PLZ-Adressierung","extern","Ja","Nein"]
[2053,"Jetzelsdorf","N","PLZ-Adressierung","extern","Ja","Nein"]
[2054,"Haugsdorf","N","PLZ-Adressierung","extern","Ja","Ja"]
[2061,"Hadres","N","PLZ-Adressierung","extern","Ja","Ja"]
[2062,"Seefeld-Großkadolz","N","PLZ-Adressierung","extern","Ja","Nein"]
[2063,"Zwingendorf","N","PLZ-Adressierung","extern","Ja","Nein"]
[2064,"Wulzeshofen","N","PLZ-Adressierung","extern","Ja","Nein"]
[2070,"Retz","N","PLZ-Adressierung","extern","Ja","Ja"]
[2073,"Schrattenthal","N","PLZ-Adressierung","extern","Ja","Nein"]
[2074,"Unterretzbach","N","PLZ-Adressierung","extern","Ja","Nein"]
[2081,"Niederfladnitz","N","PLZ-Adressierung","extern","Ja","Nein"]
[2082,"Hardegg","N","PLZ-Adressierung","extern","Ja","Nein"]
[2083,"Pleißing","N","PLZ-Adressierung","extern","Ja","Nein"]
[2084,"Weitersfeld","N","PLZ-Adressierung","extern","Ja","Ja"]
[2091,"Langau","N","PLZ-Adressierung","extern","Ja","Nein"]
[2092,"Riegersburg","N","PLZ-Adressierung","extern","Ja","Nein"]
[2093,"Geras","N","PLZ-Adressierung","extern","Ja","Ja"]
[2094,"Zissersdorf","N","PLZ-Adressierung","extern","Ja","Nein"]
[2095,"Drosendorf","N","PLZ-Adressierung","extern","Ja","Nein"]
[2100,"Korneuburg","N","PLZ-Adressierung","extern","Ja","Ja"]
[2102,"Bisamberg","N","PLZ-Adressierung","extern","Ja","Ja"]
[2103,"Langenzersdorf","N","PLZ-Adressierung","extern","Ja","Ja"]
[2104,"Spillern","N","PLZ-Adressierung","extern","Ja","Ja"]
[2105,"Oberrohrbach","N","PLZ-Adressierung","extern","Ja","Nein"]
[2111,"Rückersdorf-Harmannsdorf","N","PLZ-Adressierung","extern","Ja","Nein"]
[2112,"Würnitz","N","PLZ-Adressierung","extern","Ja","Nein"]
[2113,"Karnabrunn","N","PLZ-Adressierung","extern","Ja","Nein"]
[2114,"Großrußbach","N","PLZ-Adressierung","extern","Ja","Nein"]
[2115,"Ernstbrunn","N","PLZ-Adressierung","extern","Ja","Ja"]
[2116,"Niederleis","N","PLZ-Adressierung","extern","Ja","Nein"]
[2120,"Wolkersdorf im Weinviertel","N","PLZ-Adressierung","extern","Ja","Ja"]
[2122,"Ulrichskirchen","N","PLZ-Adressierung","extern","Ja","Ja"]
[2123,"Schleinbach","N","PLZ-Adressierung","extern","Ja","Nein"]
[2124,"Niederkreuzstetten","N","PLZ-Adressierung","extern","Ja","Ja"]
[2125,"Neubau","N","PLZ-Adressierung","extern","Ja","Nein"]
[2126,"Ladendorf","N","PLZ-Adressierung","extern","Ja","Nein"]
[2130,"Mistelbach","N","PLZ-Adressierung","extern","Ja","Ja"]
[2132,"Frättingsdorf","N","PLZ-Adressierung","extern","Ja","Nein"]
[2133,"Loosdorf","N","PLZ-Adressierung","extern","Ja","Nein"]
[2134,"Staatz-Kautendorf","N","PLZ-Adressierung","extern","Ja","Nein"]
[2135,"Neudorf bei Staatz","N","PLZ-Adressierung","extern","Ja","Nein"]
[2136,"Laa an der Thaya","N","PLZ-Adressierung","extern","Ja","Ja"]
[2141,"Ameis","N","PLZ-Adressierung","extern","Ja","Ja"]
[2143,"Großkrut","N","PLZ-Adressierung","extern","Ja","Nein"]
[2144,"Altlichtenwarth","N","PLZ-Adressierung","extern","Ja","Nein"]
[2145,"Hausbrunn","N","PLZ-Adressierung","extern","Ja","Ja"]
[2151,"Asparn an der Zaya","N","PLZ-Adressierung","extern","Ja","Nein"]
[2152,"Gnadendorf","N","PLZ-Adressierung","extern","Ja","Ja"]
[2153,"Stronsdorf","N","PLZ-Adressierung","extern","Ja","Nein"]
[2154,"Unterstinkenbrunn","N","PLZ-Adressierung","extern","Ja","Nein"]
[2161,"Poysbrunn","N","PLZ-Adressierung","extern","Ja","Ja"]
[2162,"Falkenstein","N","PLZ-Adressierung","extern","Ja","Nein"]
[2163,"Ottenthal","N","PLZ-Adressierung","extern","Ja","Ja"]
[2164,"Wildendürnbach","N","PLZ-Adressierung","extern","Ja","Nein"]
[2165,"Drasenhofen","N","PLZ-Adressierung","extern","Ja","Nein"]
[2170,"Poysdorf","N","PLZ-Adressierung","extern","Ja","Ja"]
[2171,"Herrnbaumgarten","N","PLZ-Adressierung","extern","Ja","Nein"]
[2172,"Schrattenberg","N","PLZ-Adressierung","extern","Ja","Ja"]
[2181,"Dobermannsdorf","N","PLZ-Adressierung","extern","Ja","Nein"]
[2182,"Palterndorf","N","PLZ-Adressierung","extern","Ja","Nein"]
[2183,"Neusiedl an der Zaya","N","PLZ-Adressierung","extern","Ja","Nein"]
[2184,"Hauskirchen","N","PLZ-Adressierung","extern","Ja","Nein"]
[2185,"Prinzendorf an der Zaya","N","PLZ-Adressierung","extern","Ja","Nein"]
[2191,"Gaweinstal","N","PLZ-Adressierung","extern","Ja","Ja"]
[2192,"Kettlasbrunn","N","PLZ-Adressierung","extern","Ja","Nein"]
[2193,"Wilfersdorf","N","PLZ-Adressierung","extern","Ja","Nein"]
[2201,"Gerasdorf","N","PLZ-Adressierung","extern","Ja","Ja"]
[2202,"Enzersfeld","N","PLZ-Adressierung","extern","Ja","Ja"]
[2203,"Großebersdorf","N","PLZ-Adressierung","extern","Ja","Ja"]
[2211,"Pillichsdorf","N","PLZ-Adressierung","extern","Ja","Nein"]
[2212,"Großengersdorf","N","PLZ-Adressierung","extern","Ja","Nein"]
[2213,"Bockfließ","N","PLZ-Adressierung","extern","Ja","Ja"]
[2214,"Auersthal","N","PLZ-Adressierung","extern","Ja","Ja"]
[2215,"Raggendorf","N","PLZ-Adressierung","extern","Ja","Nein"]
[2221,"Groß Schweinbarth","N","PLZ-Adressierung","extern","Ja","Nein"]
[2222,"Bad Pirawarth","N","PLZ-Adressierung","extern","Ja","Nein"]
[2223,"Hohenruppersdorf","N","PLZ-Adressierung","extern","Ja","Nein"]
[2224,"Obersulz","N","PLZ-Adressierung","extern","Ja","Nein"]
[2225,"Zistersdorf","N","PLZ-Adressierung","extern","Ja","Ja"]
[2230,"Gänserndorf","N","PLZ-Adressierung","extern","Ja","Ja"]
[2231,"Strasshof an der Nordbahn","N","PLZ-Adressierung","extern","Ja","Ja"]
[2232,"Deutsch Wagram","N","PLZ-Adressierung","extern","Ja","Ja"]
[2241,"Schönkirchen","N","PLZ-Adressierung","extern","Ja","Nein"]
[2242,"Prottes","N","PLZ-Adressierung","extern","Ja","Ja"]
[2243,"Matzen","N","PLZ-Adressierung","extern","Ja","Nein"]
[2244,"Spannberg","N","PLZ-Adressierung","extern","Ja","Nein"]
[2245,"Velm-Götzendorf","N","PLZ-Adressierung","extern","Ja","Nein"]
[2251,"Ebenthal","N","PLZ-Adressierung","extern","Ja","Nein"]
[2252,"Ollersdorf","N","PLZ-Adressierung","extern","Ja","Nein"]
[2253,"Weikendorf","N","PLZ-Adressierung","extern","Ja","Nein"]
[2261,"Angern an der March","N","PLZ-Adressierung","extern","Ja","Ja"]
[2262,"Stillfried","N","PLZ-Adressierung","extern","Ja","Nein"]
[2263,"Dürnkrut","N","PLZ-Adressierung","extern","Ja","Ja"]
[2264,"Jedenspeigen","N","PLZ-Adressierung","extern","Ja","Nein"]
[2265,"Drösing","N","PLZ-Adressierung","extern","Ja","Nein"]
[2272,"Niederabsdorf","N","PLZ-Adressierung","extern","Ja","Nein"]
[2273,"Hohenau an der March","N","PLZ-Adressierung","extern","Ja","Ja"]
[2274,"Rabensburg","N","PLZ-Adressierung","extern","Ja","Ja"]
[2275,"Bernhardsthal","N","PLZ-Adressierung","extern","Ja","Nein"]
[2276,"Reintal","N","PLZ-Adressierung","extern","Ja","Nein"]
[2281,"Raasdorf","N","PLZ-Adressierung","extern","Ja","Nein"]
[2282,"Markgrafneusiedl","N","PLZ-Adressierung","extern","Ja","Nein"]
[2283,"Obersiebenbrunn","N","PLZ-Adressierung","extern","Ja","Ja"]
[2284,"Untersiebenbrunn","N","PLZ-Adressierung","extern","Ja","Nein"]
[2285,"Leopoldsdorf im Marchfelde","N","PLZ-Adressierung","extern","Ja","Nein"]
[2286,"Haringsee","N","PLZ-Adressierung","extern","Ja","Nein"]
[2291,"Lassee","N","PLZ-Adressierung","extern","Ja","Ja"]
[2292,"Engelhartstetten","N","PLZ-Adressierung","extern","Ja","Nein"]
[2293,"Marchegg Stadt","N","PLZ-Adressierung","extern","Ja","Nein"]
[2294,"Marchegg Bahnhof","N","PLZ-Adressierung","extern","Ja","Ja"]
[2295,"Oberweiden","N","PLZ-Adressierung","extern","Ja","Nein"]
[2301,"Groß-Enzersdorf","N","PLZ-Adressierung","extern","Ja","Ja"]
[2304,"Orth an der Donau","N","PLZ-Adressierung","extern","Ja","Ja"]
[2305,"Eckartsau","N","PLZ-Adressierung","extern","Ja","Nein"]
[2320,"Schwechat","N","PLZ-Adressierung","extern","Ja","Ja"]
[2322,"Zwölfaxing","N","PLZ-Adressierung","extern","Ja","Nein"]
[2323,"Schwechat-Mannswörth","N","PLZ-Postfach","extern","Nein","Ja"]
[2324,"Schwechat-Rannersdorf","N","PLZ-Postfach","extern","Nein","Ja"]
[2325,"Himberg","N","PLZ-Adressierung","extern","Ja","Ja"]
[2326,"Maria Lanzendorf","N","PLZ-Adressierung","extern","Ja","Ja"]
[2331,"Vösendorf","N","PLZ-Adressierung","extern","Ja","Ja"]
[2332,"Hennersdorf","N","PLZ-Adressierung","extern","Ja","Ja"]
[2333,"Leopoldsdorf","N","PLZ-Adressierung","extern","Ja","Ja"]
[2334,"Vösendorf","N","PLZ-Adressierung","extern","Ja","Ja"]
[2340,"Mödling","N","PLZ-Adressierung","extern","Ja","Ja"]
[2342,"Mödling","N","PLZ-Postfach","extern","Nein","Ja"]
[2344,"Maria Enzersdorf","N","PLZ-Adressierung","extern","Ja","Ja"]
[2345,"Brunn am Gebirge","N","PLZ-Adressierung","extern","Ja","Ja"]
[2346,"Maria Enzersdorf-Südstadt","N","PLZ-Postfach","extern","Nein","Ja"]
[2351,"Wiener Neudorf","N","PLZ-Adressierung","extern","Ja","Ja"]
[2352,"Gumpoldskirchen","N","PLZ-Adressierung","extern","Ja","Ja"]
[2353,"Guntramsdorf","N","PLZ-Adressierung","extern","Ja","Ja"]
[2355,"Wiener Neudorf","N","PLZ-Postfach","extern","Nein","Ja"]
[2361,"Laxenburg","N","PLZ-Adressierung","extern","Ja","Ja"]
[2362,"Biedermannsdorf","N","PLZ-Adressierung","extern","Ja","Ja"]
[2371,"Hinterbrühl","N","PLZ-Adressierung","extern","Ja","Ja"]
[2372,"Gießhübl","N","PLZ-Adressierung","extern","Ja","Nein"]
[2380,"Perchtoldsdorf","N","PLZ-Adressierung","extern","Ja","Ja"]
[2381,"Laab im Walde","N","PLZ-Adressierung","extern","Ja","Nein"]
[2384,"Breitenfurt bei Wien","N","PLZ-Adressierung","extern","Ja","Ja"]
[2391,"Kaltenleutgeben","N","PLZ-Adressierung","extern","Ja","Ja"]
[2392,"Sulz im Wienerwald","N","PLZ-Adressierung","extern","Ja","Ja"]
[2393,"Sittendorf","N","PLZ-Adressierung","extern","Ja","Nein"]
[2401,"Fischamend","N","PLZ-Adressierung","extern","Ja","Ja"]
[2402,"Maria Ellend","N","PLZ-Adressierung","extern","Ja","Ja"]
[2403,"Regelsbrunn","N","PLZ-Adressierung","extern","Ja","Nein"]
[2404,"Petronell","N","PLZ-Adressierung","extern","Ja","Nein"]
[2405,"Bad Deutsch Altenburg","N","PLZ-Adressierung","extern","Ja","Ja"]
[2410,"Hainburg an der Donau","N","PLZ-Adressierung","extern","Ja","Ja"]
[2412,"Wolfsthal","N","PLZ-Adressierung","extern","Ja","Nein"]
[2413,"Berg","N","PLZ-Adressierung","extern","Ja","Nein"]
[2421,"Kittsee","B","PLZ-Adressierung","extern","Ja","Ja"]
[2422,"Pama","B","PLZ-Adressierung","extern","Ja","Nein"]
[2423,"Deutsch Jahrndorf","B","PLZ-Adressierung","extern","Ja","Nein"]
[2424,"Zurndorf","B","PLZ-Adressierung","extern","Ja","Ja"]
[2425,"Nickelsdorf","B","PLZ-Adressierung","extern","Ja","Ja"]
[2431,"Kleinneusiedl","N","PLZ-Adressierung","extern","Ja","Nein"]
[2432,"Schwadorf","N","PLZ-Adressierung","extern","Ja","Ja"]
[2433,"Margarethen am Moos","N","PLZ-Adressierung","extern","Ja","Nein"]
[2434,"Götzendorf an der Leitha","N","PLZ-Adressierung","extern","Ja","Nein"]
[2435,"Ebergassing","N","PLZ-Adressierung","extern","Ja","Ja"]
[2440,"Gramatneusiedl","N","PLZ-Adressierung","extern","Ja","Ja"]
[2441,"Mitterndorf an der Fischa","N","PLZ-Adressierung","extern","Ja","Nein"]
[2442,"Unterwaltersdorf","N","PLZ-Adressierung","extern","Ja","Ja"]
[2443,"Deutsch Brodersdorf","N","PLZ-Adressierung","extern","Ja","Ja"]
[2444,"Seibersdorf","N","PLZ-Adressierung","extern","Ja","Nein"]
[2451,"Hof am Leithaberge","N","PLZ-Adressierung","extern","Ja","Ja"]
[2452,"Mannersdorf am Leithagebirge","N","PLZ-Adressierung","extern","Ja","Ja"]
[2453,"Sommerein","N","PLZ-Adressierung","extern","Ja","Nein"]
[2454,"Trautmannsdorf an der Leitha","N","PLZ-Adressierung","extern","Ja","Nein"]
[2460,"Bruck an der Leitha","N","PLZ-Adressierung","extern","Ja","Ja"]
[2462,"Wilfleinsdorf","N","PLZ-Adressierung","extern","Ja","Nein"]
[2463,"Stixneusiedl","N","PLZ-Adressierung","extern","Ja","Nein"]
[2464,"Göttlesbrunn","N","PLZ-Adressierung","extern","Ja","Nein"]
[2465,"Höflein","N","PLZ-Adressierung","extern","Ja","Nein"]
[2471,"Rohrau","N","PLZ-Adressierung","extern","Ja","Nein"]
[2472,"Prellenkirchen","N","PLZ-Adressierung","extern","Ja","Nein"]
[2473,"Potzneusiedl","B","PLZ-Adressierung","extern","Ja","Nein"]
[2474,"Gattendorf","B","PLZ-Adressierung","extern","Ja","Ja"]
[2475,"Neudorf","B","PLZ-Adressierung","extern","Ja","Nein"]
[2481,"Achau","N","PLZ-Adressierung","extern","Ja","Ja"]
[2482,"Münchendorf","N","PLZ-Adressierung","extern","Ja","Ja"]
[2483,"Ebreichsdorf","N","PLZ-Adressierung","extern","Ja","Ja"]
[2485,"Wampersdorf","N","PLZ-Adressierung","extern","Ja","Ja"]
[2486,"Pottendorf","N","PLZ-Adressierung","extern","Ja","Ja"]
[2490,"Ebenfurth","N","PLZ-Adressierung","extern","Ja","Ja"]
[2491,"Neufeld an der Leitha","B","PLZ-Adressierung","extern","Ja","Ja"]
[2492,"Eggendorf","N","PLZ-Adressierung","extern","Ja","Nein"]
[2493,"Lichtenwörth-Nadelburg","N","PLZ-Adressierung","extern","Ja","Ja"]
[2500,"Baden","N","PLZ-Adressierung","extern","Ja","Ja"]
[2502,"Baden-Leesdorf","N","PLZ-Postfach","extern","Nein","Ja"]
[2511,"Pfaffstätten","N","PLZ-Adressierung","extern","Ja","Ja"]
[2512,"Tribuswinkel","N","PLZ-Adressierung","extern","Ja","Ja"]
[2513,"Möllersdorf","N","PLZ-Postfach","extern","Nein","Ja"]
[2514,"Traiskirchen","N","PLZ-Adressierung","extern","Ja","Ja"]
[2521,"Trumau","N","PLZ-Adressierung","extern","Ja","Ja"]
[2522,"Oberwaltersdorf","N","PLZ-Adressierung","extern","Ja","Ja"]
[2523,"Tattendorf","N","PLZ-Adressierung","extern","Ja","Ja"]
[2524,"Teesdorf","N","PLZ-Adressierung","extern","Ja","Nein"]
[2525,"Günselsdorf","N","PLZ-Adressierung","extern","Ja","Ja"]
[2531,"Gaaden","N","PLZ-Adressierung","extern","Ja","Nein"]
[2532,"Heiligenkreuz","N","PLZ-Adressierung","extern","Ja","Ja"]
[2533,"Klausen-Leopoldsdorf","N","PLZ-Adressierung","extern","Ja","Nein"]
[2534,"Alland","N","PLZ-Adressierung","extern","Ja","Ja"]
[2540,"Bad Vöslau","N","PLZ-Adressierung","extern","Ja","Ja"]
[2542,"Kottingbrunn","N","PLZ-Adressierung","extern","Ja","Ja"]
[2544,"Leobersdorf","N","PLZ-Adressierung","extern","Ja","Ja"]
[2551,"Enzesfeld-Lindabrunn","N","PLZ-Adressierung","extern","Ja","Ja"]
[2552,"Hirtenberg","N","PLZ-Adressierung","extern","Ja","Ja"]
[2560,"Berndorf","N","PLZ-Adressierung","extern","Ja","Ja"]
[2562,"Berndorf, Niederösterreich","N","PLZ-Postfach","extern","Nein","Ja"]
[2563,"Pottenstein","N","PLZ-Adressierung","extern","Ja","Ja"]
[2564,"Weissenbach an der Triesting","N","PLZ-Adressierung","extern","Ja","Ja"]
[2565,"Neuhaus","N","PLZ-Adressierung","extern","Ja","Nein"]
[2571,"Altenmarkt-Thenneberg","N","PLZ-Adressierung","extern","Ja","Ja"]
[2572,"Kaumberg","N","PLZ-Adressierung","extern","Ja","Nein"]
[2601,"Sollenau","N","PLZ-Adressierung","extern","Ja","Ja"]
[2602,"Blumau-Neurißhof","N","PLZ-Adressierung","extern","Ja","Nein"]
[2603,"Felixdorf","N","PLZ-Adressierung","extern","Ja","Ja"]
[2604,"Theresienfeld","N","PLZ-Adressierung","extern","Ja","Ja"]
[2620,"Neunkirchen","N","PLZ-Adressierung","extern","Ja","Ja"]
[2622,"Neunkirchen, Niederösterreich","N","PLZ-Postfach","extern","Nein","Ja"]
[2624,"Breitenau","N","PLZ-Adressierung","extern","Ja","Nein"]
[2625,"Schwarzau am Steinfelde","N","PLZ-Adressierung","extern","Ja","Nein"]
[2630,"Ternitz","N","PLZ-Adressierung","extern","Ja","Ja"]
[2631,"Sieding-Stixenstein","N","PLZ-Adressierung","extern","Ja","Nein"]
[2632,"Wimpassing im Schwarzatale","N","PLZ-Adressierung","extern","Ja","Ja"]
[2640,"Gloggnitz","N","PLZ-Adressierung","extern","Ja","Ja"]
[2641,"Schottwien","N","PLZ-Adressierung","extern","Ja","Nein"]
[2642,"Maria Schutz","N","PLZ-Adressierung","extern","Ja","Nein"]
[2650,"Payerbach","N","PLZ-Adressierung","extern","Ja","Ja"]
[2651,"Reichenau an der Rax","N","PLZ-Adressierung","extern","Ja","Ja"]
[2654,"Prein an der Rax","N","PLZ-Adressierung","extern","Ja","Nein"]
[2661,"Naßwald","N","PLZ-Adressierung","extern","Ja","Nein"]
[2662,"Schwarzau im Gebirge","N","PLZ-Adressierung","extern","Ja","Nein"]
[2663,"Rohr im Gebirge","N","PLZ-Adressierung","extern","Ja","Nein"]
[2671,"Küb","N","PLZ-Adressierung","extern","Ja","Nein"]
[2673,"Breitenstein","N","PLZ-Adressierung","extern","Ja","Nein"]
[2680,"Semmering","N","PLZ-Adressierung","extern","Ja","Nein"]
[2700,"Wiener Neustadt","N","PLZ-Adressierung","extern","Ja","Ja"]
[2702,"Wiener Neustadt","N","PLZ-Postfach","extern","Nein","Ja"]
[2704,"Wiener Neustadt","N","PLZ-Postfach","extern","Nein","Ja"]
[2705,"Wiener Neustadt","N","PLZ-Postfach","extern","Nein","Ja"]
[2706,"Wiener Neustadt","N","InteressentenPLZ","extern","Nein","Ja"]
[2721,"Bad Fischau","N","PLZ-Adressierung","extern","Ja","Ja"]
[2722,"Winzendorf","N","PLZ-Adressierung","extern","Ja","Ja"]
[2723,"Muthmannsdorf","N","PLZ-Adressierung","extern","Ja","Nein"]
[2724,"Hohe Wand-Stollhof","N","PLZ-Adressierung","extern","Ja","Nein"]
[2731,"St. Egyden am Steinfeld","N","PLZ-Adressierung","extern","Ja","Nein"]
[2732,"Willendorf","N","PLZ-Adressierung","extern","Ja","Ja"]
[2733,"Grünbach am Schneeberg","N","PLZ-Adressierung","extern","Ja","Ja"]
[2734,"Puchberg am Schneeberg","N","PLZ-Adressierung","extern","Ja","Ja"]
[2751,"Steinabrückl","N","PLZ-Adressierung","extern","Ja","Ja"]
[2752,"Wöllersdorf","N","PLZ-Adressierung","extern","Ja","Ja"]
[2753,"Markt Piesting","N","PLZ-Adressierung","extern","Ja","Ja"]
[2754,"Waldegg","N","PLZ-Adressierung","extern","Ja","Ja"]
[2755,"Oed","N","PLZ-Adressierung","extern","Ja","Nein"]
[2761,"Miesenbach","N","PLZ-Adressierung","extern","Ja","Nein"]
[2763,"Pernitz","N","PLZ-Adressierung","extern","Ja","Ja"]
[2770,"Gutenstein","N","PLZ-Adressierung","extern","Ja","Nein"]
[2801,"Katzelsdorf","N","PLZ-Adressierung","extern","Ja","Nein"]
[2802,"Hochwolkersdorf","N","PLZ-Adressierung","extern","Ja","Nein"]
[2803,"Schwarzenbach","N","PLZ-Adressierung","extern","Ja","Nein"]
[2811,"Wiesmath","N","PLZ-Adressierung","extern","Ja","Ja"]
[2812,"Hollenthon","N","PLZ-Adressierung","extern","Ja","Nein"]
[2813,"Lichtenegg","N","PLZ-Adressierung","extern","Ja","Nein"]
[2821,"Lanzenkirchen","N","PLZ-Adressierung","extern","Ja","Ja"]
[2822,"Bad Erlach","N","PLZ-Adressierung","extern","Ja","Ja"]
[2823,"Pitten","N","PLZ-Adressierung","extern","Ja","Ja"]
[2824,"Seebenstein","N","PLZ-Adressierung","extern","Ja","Nein"]
[2831,"Warth","N","PLZ-Adressierung","extern","Ja","Ja"]
[2832,"Thernberg","N","PLZ-Adressierung","extern","Ja","Nein"]
[2833,"Bromberg","N","PLZ-Adressierung","extern","Ja","Nein"]
[2840,"Grimmenstein","N","PLZ-Adressierung","extern","Ja","Ja"]
[2842,"Edlitz","N","PLZ-Adressierung","extern","Ja","Nein"]
[2851,"Krumbach","N","PLZ-Adressierung","extern","Ja","Ja"]
[2852,"Hochneukirchen","N","PLZ-Adressierung","extern","Ja","Nein"]
[2853,"Bad Schönau","N","PLZ-Adressierung","extern","Ja","Nein"]
[2860,"Kirchschlag in der Buckligen Welt","N","PLZ-Adressierung","extern","Ja","Ja"]
[2870,"Aspang","N","PLZ-Adressierung","extern","Ja","Ja"]
[2871,"Zöbern","N","PLZ-Adressierung","extern","Ja","Nein"]
[2872,"Mönichkirchen","N","PLZ-Adressierung","extern","Ja","Nein"]
[2873,"Feistritz am Wechsel","N","PLZ-Adressierung","extern","Ja","Nein"]
[2880,"Kirchberg am Wechsel","N","PLZ-Adressierung","extern","Ja","Ja"]
[2881,"Trattenbach","N","PLZ-Adressierung","extern","Ja","Nein"]
[3001,"Mauerbach","N","PLZ-Adressierung","extern","Ja","Ja"]
[3002,"Purkersdorf","N","PLZ-Adressierung","extern","Ja","Ja"]
[3003,"Gablitz","N","PLZ-Adressierung","extern","Ja","Ja"]
[3004,"Ried am Riederberg","N","PLZ-Adressierung","extern","Ja","Nein"]
[3011,"Untertullnerbach","N","PLZ-Adressierung","extern","Ja","Ja"]
[3012,"Wolfsgraben","N","PLZ-Adressierung","extern","Ja","Ja"]
[3013,"Tullnerbach-Lawies","N","PLZ-Adressierung","extern","Ja","Ja"]
[3021,"Pressbaum","N","PLZ-Adressierung","extern","Ja","Ja"]
[3031,"Rekawinkel","N","PLZ-Adressierung","extern","Ja","Nein"]
[3032,"Eichgraben","N","PLZ-Adressierung","extern","Ja","Ja"]
[3033,"Altlengbach","N","PLZ-Adressierung","extern","Ja","Ja"]
[3034,"Maria Anzbach","N","PLZ-Adressierung","extern","Ja","Ja"]
[3040,"Neulengbach","N","PLZ-Adressierung","extern","Ja","Ja"]
[3041,"Asperhofen","N","PLZ-Adressierung","extern","Ja","Nein"]
[3042,"Würmla","N","PLZ-Adressierung","extern","Ja","Nein"]
[3051,"St. Christophen","N","PLZ-Adressierung","extern","Ja","Nein"]
[3052,"Innermanzing","N","PLZ-Adressierung","extern","Ja","Nein"]
[3053,"Laaben","N","PLZ-Adressierung","extern","Ja","Nein"]
[3061,"Ollersbach","N","PLZ-Adressierung","extern","Ja","Nein"]
[3062,"Kirchstetten","N","PLZ-Adressierung","extern","Ja","Ja"]
[3071,"Böheimkirchen","N","PLZ-Adressierung","extern","Ja","Ja"]
[3072,"Kasten bei Böheimkirchen","N","PLZ-Adressierung","extern","Ja","Nein"]
[3073,"Stössing","N","PLZ-Adressierung","extern","Ja","Ja"]
[3074,"Michelbach","N","PLZ-Adressierung","extern","Ja","Nein"]
[3100,"St. Pölten","N","PLZ-Adressierung","extern","Ja","Ja"]
[3101,"St. Pölten Postfach","N","PLZ-Postfach","extern","Nein","Ja"]
[3102,"St. Pölten","N","PLZ-Postfach","extern","Nein","Ja"]
[3103,"St. Pölten","N","PLZ-Postfach","extern","Nein","Ja"]
[3104,"St. Pölten-Harland","N","PLZ-Adressierung","extern","Ja","Nein"]
[3105,"St. Pölten-Radlberg","N","PLZ-Adressierung","extern","Ja","Nein"]
[3106,"St. Pölten-Spratzern","N","PLZ-Postfach","extern","Nein","Ja"]
[3107,"St. Pölten-Traisenpark","N","PLZ-Adressierung","extern","Ja","Ja"]
[3108,"St. Pölten-Wagram","N","PLZ-Postfach","extern","Nein","Ja"]
[3109,"St. Pölten","N","PLZ-Postfach","extern","Nein","Ja"]
[3110,"Neidling","N","PLZ-Adressierung","extern","Ja","Nein"]
[3111,"St. Pölten","N","PLZ-Postfach","extern","Nein","Ja"]
[3121,"Karlstetten","N","PLZ-Adressierung","extern","Ja","Ja"]
[3122,"Gansbach","N","PLZ-Adressierung","extern","Ja","Nein"]
[3123,"Obritzberg","N","PLZ-Adressierung","extern","Ja","Nein"]
[3124,"Oberwölbling","N","PLZ-Adressierung","extern","Ja","Nein"]
[3125,"Statzendorf","N","PLZ-Adressierung","extern","Ja","Nein"]
[3130,"Herzogenburg","N","PLZ-Adressierung","extern","Ja","Ja"]
[3131,"Getzersdorf","N","PLZ-Adressierung","extern","Ja","Nein"]
[3133,"Traismauer","N","PLZ-Adressierung","extern","Ja","Ja"]
[3134,"Nußdorf","N","PLZ-Adressierung","extern","Ja","Nein"]
[3140,"Pottenbrunn","N","PLZ-Adressierung","extern","Ja","Nein"]
[3141,"Kapelln","N","PLZ-Adressierung","extern","Ja","Nein"]
[3142,"Perschling","N","PLZ-Adressierung","extern","Ja","Nein"]
[3143,"Pyhra","N","PLZ-Adressierung","extern","Ja","Ja"]
[3144,"Wald","N","PLZ-Adressierung","extern","Ja","Nein"]
[3150,"Wilhelmsburg","N","PLZ-Adressierung","extern","Ja","Ja"]
[3151,"St. Georgen am Steinfelde","N","PLZ-Adressierung","extern","Ja","Nein"]
[3153,"Eschenau","N","PLZ-Adressierung","extern","Ja","Nein"]
[3160,"Traisen","N","PLZ-Adressierung","extern","Ja","Ja"]
[3161,"St. Veit an der Gölsen","N","PLZ-Adressierung","extern","Ja","Ja"]
[3162,"Rainfeld","N","PLZ-Adressierung","extern","Ja","Nein"]
[3163,"Rohrbach","N","PLZ-Adressierung","extern","Ja","Nein"]
[3170,"Hainfeld","N","PLZ-Adressierung","extern","Ja","Ja"]
[3171,"Kleinzell-Salzerbad","N","PLZ-Adressierung","extern","Ja","Nein"]
[3172,"Ramsau","N","PLZ-Adressierung","extern","Ja","Nein"]
[3180,"Lilienfeld","N","PLZ-Adressierung","extern","Ja","Ja"]
[3182,"Marktl, Traisental","N","InteressentenPLZ","extern","Nein","Ja"]
[3183,"Freiland","N","PLZ-Adressierung","extern","Ja","Nein"]
[3184,"Türnitz","N","PLZ-Adressierung","extern","Ja","Ja"]
[3192,"Hohenberg","N","PLZ-Adressierung","extern","Ja","Nein"]
[3193,"St. Aegyd am Neuwalde","N","PLZ-Adressierung","extern","Ja","Ja"]
[3195,"Kernhof","N","PLZ-Adressierung","extern","Ja","Nein"]
[3200,"Ober-Grafendorf","N","PLZ-Adressierung","extern","Ja","Ja"]
[3202,"Hofstetten","N","PLZ-Adressierung","extern","Ja","Nein"]
[3203,"Rabenstein an der Pielach","N","PLZ-Adressierung","extern","Ja","Ja"]
[3204,"Kirchberg an der Pielach","N","PLZ-Adressierung","extern","Ja","Ja"]
[3211,"Loich","N","PLZ-Adressierung","extern","Ja","Nein"]
[3212,"Schwarzenbach an der Pielach","N","PLZ-Adressierung","extern","Ja","Nein"]
[3213,"Frankenfels","N","PLZ-Adressierung","extern","Ja","Ja"]
[3214,"Puchenstuben","N","PLZ-Adressierung","extern","Ja","Ja"]
[3221,"Gösing an der Mariazellerbahn","N","PLZ-Adressierung","extern","Ja","Nein"]
[3222,"Annaberg","N","PLZ-Adressierung","extern","Ja","Nein"]
[3223,"Wienerbruck","N","PLZ-Adressierung","extern","Ja","Nein"]
[3224,"Mitterbach","N","PLZ-Adressierung","extern","Ja","Nein"]
[3231,"St. Margarethen an der Sierning","N","PLZ-Adressierung","extern","Ja","Nein"]
[3232,"Bischofstetten","N","PLZ-Adressierung","extern","Ja","Nein"]
[3233,"Kilb","N","PLZ-Adressierung","extern","Ja","Nein"]
[3240,"Mank","N","PLZ-Adressierung","extern","Ja","Ja"]
[3241,"Kirnberg an der Mank","N","PLZ-Adressierung","extern","Ja","Nein"]
[3242,"Texing","N","PLZ-Adressierung","extern","Ja","Nein"]
[3243,"St. Leonhard am Forst","N","PLZ-Adressierung","extern","Ja","Ja"]
[3244,"Ruprechtshofen","N","PLZ-Adressierung","extern","Ja","Nein"]
[3250,"Wieselburg","N","PLZ-Adressierung","extern","Ja","Ja"]
[3251,"Purgstall","N","PLZ-Adressierung","extern","Ja","Ja"]
[3252,"Petzenkirchen","N","PLZ-Adressierung","extern","Ja","Nein"]
[3253,"Erlauf","N","PLZ-Adressierung","extern","Ja","Nein"]
[3261,"Steinakirchen am Forst","N","PLZ-Adressierung","extern","Ja","Ja"]
[3262,"Wang","N","PLZ-Adressierung","extern","Ja","Nein"]
[3263,"Randegg","N","PLZ-Adressierung","extern","Ja","Nein"]
[3264,"Gresten","N","PLZ-Adressierung","extern","Ja","Ja"]
[3270,"Scheibbs","N","PLZ-Adressierung","extern","Ja","Ja"]
[3281,"Oberndorf an der Melk","N","PLZ-Adressierung","extern","Ja","Ja"]
[3282,"St. Georgen an der Leys","N","PLZ-Adressierung","extern","Ja","Nein"]
[3283,"St. Anton an der Jeßnitz","N","PLZ-Adressierung","extern","Ja","Nein"]
[3291,"Kienberg","N","PLZ-Adressierung","extern","Ja","Nein"]
[3292,"Gaming","N","PLZ-Adressierung","extern","Ja","Ja"]
[3293,"Lunz am See","N","PLZ-Adressierung","extern","Ja","Ja"]
[3294,"Langau","N","PLZ-Adressierung","extern","Ja","Nein"]
[3295,"Lackenhof","N","PLZ-Adressierung","extern","Ja","Nein"]
[3300,"Amstetten","N","PLZ-Adressierung","extern","Ja","Ja"]
[3302,"Amstetten, Niederösterreich","N","PLZ-Postfach","extern","Nein","Ja"]
[3304,"St. Georgen am Ybbsfelde","N","PLZ-Adressierung","extern","Ja","Nein"]
[3311,"Zeillern","N","PLZ-Adressierung","extern","Ja","Nein"]
[3312,"Oed","N","PLZ-Adressierung","extern","Ja","Nein"]
[3313,"Wallsee","N","PLZ-Adressierung","extern","Ja","Nein"]
[3314,"Strengberg","N","PLZ-Adressierung","extern","Ja","Ja"]
[3321,"Ardagger","N","PLZ-Adressierung","extern","Ja","Ja"]
[3322,"Viehdorf","N","PLZ-Adressierung","extern","Ja","Nein"]
[3323,"Neustadtl an der Donau","N","PLZ-Adressierung","extern","Ja","Nein"]
[3324,"Euratsfeld","N","PLZ-Adressierung","extern","Ja","Ja"]
[3325,"Ferschnitz","N","PLZ-Adressierung","extern","Ja","Nein"]
[3331,"Kematen","N","PLZ-Adressierung","extern","Ja","Ja"]
[3332,"Rosenau am Sonntagberg","N","PLZ-Adressierung","extern","Ja","Nein"]
[3333,"Böhlerwerk","N","PLZ-Adressierung","extern","Ja","Nein"]
[3334,"Gaflenz","O","PLZ-Adressierung","extern","Ja","Ja"]
[3335,"Weyer","O","PLZ-Adressierung","extern","Ja","Ja"]
[3340,"Waidhofen an der Ybbs","N","PLZ-Adressierung","extern","Ja","Ja"]
[3341,"Ybbsitz","N","PLZ-Adressierung","extern","Ja","Ja"]
[3342,"Opponitz","N","PLZ-Adressierung","extern","Ja","Nein"]
[3343,"Hollenstein an der Ybbs","N","PLZ-Adressierung","extern","Ja","Ja"]
[3344,"St. Georgen am Reith","N","PLZ-Adressierung","extern","Ja","Nein"]
[3345,"Göstling an der Ybbs","N","PLZ-Adressierung","extern","Ja","Ja"]
[3350,"Haag","N","PLZ-Adressierung","extern","Ja","Ja"]
[3351,"Weistrach","N","PLZ-Adressierung","extern","Ja","Nein"]
[3352,"St. Peter in der Au","N","PLZ-Adressierung","extern","Ja","Ja"]
[3353,"Seitenstetten","N","PLZ-Adressierung","extern","Ja","Ja"]
[3354,"Wolfsbach","N","PLZ-Adressierung","extern","Ja","Nein"]
[3355,"Ertl","N","PLZ-Adressierung","extern","Ja","Nein"]
[3361,"Aschbach Markt","N","PLZ-Adressierung","extern","Ja","Ja"]
[3362,"Mauer-Öhling","N","PLZ-Adressierung","extern","Ja","Nein"]
[3363,"Ulmerfeld-Hausmening","N","PLZ-Adressierung","extern","Ja","Ja"]
[3364,"Neuhofen an der Ybbs","N","PLZ-Adressierung","extern","Ja","Nein"]
[3365,"Allhartsberg","N","PLZ-Adressierung","extern","Ja","Nein"]
[3370,"Ybbs an der Donau","N","PLZ-Adressierung","extern","Ja","Ja"]
[3371,"Neumarkt an der Ybbs","N","PLZ-Adressierung","extern","Ja","Nein"]
[3372,"Blindenmarkt","N","PLZ-Adressierung","extern","Ja","Ja"]
[3373,"Kemmelbach","N","PLZ-Adressierung","extern","Ja","Ja"]
[3374,"Säusenstein","N","PLZ-Adressierung","extern","Ja","Nein"]
[3375,"Krummnußbaum","N","PLZ-Adressierung","extern","Ja","Nein"]
[3380,"Pöchlarn","N","PLZ-Adressierung","extern","Ja","Ja"]
[3381,"Golling","N","PLZ-Adressierung","extern","Ja","Nein"]
[3382,"Loosdorf","N","PLZ-Adressierung","extern","Ja","Ja"]
[3383,"Hürm","N","PLZ-Adressierung","extern","Ja","Ja"]
[3384,"Groß Sierning","N","PLZ-Adressierung","extern","Ja","Nein"]
[3385,"Prinzersdorf","N","PLZ-Adressierung","extern","Ja","Ja"]
[3386,"Hafnerbach","N","PLZ-Adressierung","extern","Ja","Nein"]
[3390,"Melk","N","PLZ-Adressierung","extern","Ja","Ja"]
[3392,"Schönbühel an der Donau","N","PLZ-Adressierung","extern","Ja","Nein"]
[3393,"Matzleinsdorf","N","PLZ-Adressierung","extern","Ja","Nein"]
[3400,"Klosterneuburg","N","PLZ-Adressierung","extern","Ja","Ja"]
[3403,"Klosterneuburg","N","PLZ-Postfach","extern","Nein","Ja"]
[3411,"Weidling","N","PLZ-Postfach","extern","Nein","Ja"]
[3412,"Kierling","N","PLZ-Postfach","extern","Nein","Ja"]
[3413,"Hintersdorf","N","PLZ-Adressierung","extern","Ja","Nein"]
[3420,"Kritzendorf","N","PLZ-Adressierung","extern","Ja","Ja"]
[3421,"Höflein an der Donau","N","PLZ-Adressierung","extern","Ja","Nein"]
[3422,"Greifenstein","N","PLZ-Adressierung","extern","Ja","Nein"]
[3423,"St. Andrä-Wördern","N","PLZ-Adressierung","extern","Ja","Ja"]
[3424,"Zeiselmauer","N","PLZ-Adressierung","extern","Ja","Ja"]
[3425,"Langenlebarn","N","PLZ-Adressierung","extern","Ja","Ja"]
[3430,"Tulln an der Donau","N","PLZ-Adressierung","extern","Ja","Ja"]
[3433,"Königstetten","N","PLZ-Adressierung","extern","Ja","Nein"]
[3434,"Tulbing","N","PLZ-Adressierung","extern","Ja","Ja"]
[3435,"Zwentendorf an der Donau","N","PLZ-Adressierung","extern","Ja","Ja"]
[3441,"Judenau","N","PLZ-Adressierung","extern","Ja","Nein"]
[3442,"Langenrohr","N","PLZ-Adressierung","extern","Ja","Nein"]
[3443,"Sieghartskirchen","N","PLZ-Adressierung","extern","Ja","Ja"]
[3451,"Michelhausen","N","PLZ-Adressierung","extern","Ja","Ja"]
[3452,"Atzenbrugg","N","PLZ-Adressierung","extern","Ja","Ja"]
[3454,"Sitzenberg-Reidling","N","PLZ-Adressierung","extern","Ja","Ja"]
[3462,"Absdorf","N","PLZ-Adressierung","extern","Ja","Ja"]
[3463,"Stetteldorf am Wagram","N","PLZ-Adressierung","extern","Ja","Nein"]
[3464,"Hausleiten","N","PLZ-Adressierung","extern","Ja","Ja"]
[3465,"Königsbrunn am Wagram","N","PLZ-Adressierung","extern","Ja","Ja"]
[3470,"Kirchberg am Wagram","N","PLZ-Adressierung","extern","Ja","Ja"]
[3471,"Großriedenthal","N","PLZ-Adressierung","extern","Ja","Ja"]
[3472,"Hohenwarth","N","PLZ-Adressierung","extern","Ja","Nein"]
[3473,"Mühlbach am Manhartsberg","N","PLZ-Adressierung","extern","Ja","Nein"]
[3474,"Altenwörth","N","PLZ-Adressierung","extern","Ja","Nein"]
[3481,"Fels am Wagram","N","PLZ-Adressierung","extern","Ja","Ja"]
[3482,"Gösing am Wagram","N","PLZ-Adressierung","extern","Ja","Nein"]
[3483,"Feuersbrunn","N","PLZ-Adressierung","extern","Ja","Nein"]
[3484,"Grafenwörth","N","PLZ-Adressierung","extern","Ja","Ja"]
[3485,"Haitzendorf","N","PLZ-Adressierung","extern","Ja","Nein"]
[3491,"Straß im Straßertale","N","PLZ-Adressierung","extern","Ja","Ja"]
[3492,"Etsdorf am Kamp","N","PLZ-Adressierung","extern","Ja","Ja"]
[3493,"Hadersdorf am Kamp","N","PLZ-Adressierung","extern","Ja","Ja"]
[3494,"Gedersdorf","N","PLZ-Adressierung","extern","Ja","Ja"]
[3495,"Rohrendorf bei Krems","N","PLZ-Adressierung","extern","Ja","Nein"]
[3500,"Krems an der Donau","N","PLZ-Adressierung","extern","Ja","Ja"]
[3502,"Krems-Lerchenfeld","N","PLZ-Postfach","extern","Nein","Ja"]
[3504,"Krems-Stein","N","PLZ-Postfach","extern","Nein","Ja"]
[3506,"Krems-Hollenburg","N","PLZ-Adressierung","extern","Ja","Nein"]
[3507,"Krems-Mitterau","N","PLZ-Postfach","extern","Nein","Ja"]
[3508,"Paudorf","N","PLZ-Adressierung","extern","Ja","Nein"]
[3511,"Furth bei Göttweig","N","PLZ-Adressierung","extern","Ja","Ja"]
[3512,"Mautern","N","PLZ-Adressierung","extern","Ja","Ja"]
[3521,"Obermeisling","N","PLZ-Adressierung","extern","Ja","Nein"]
[3522,"Lichtenau","N","PLZ-Adressierung","extern","Ja","Nein"]
[3524,"Grainbrunn","N","PLZ-Adressierung","extern","Ja","Ja"]
[3525,"Sallingberg","N","PLZ-Adressierung","extern","Ja","Nein"]
[3531,"Niedernondorf","N","PLZ-Adressierung","extern","Ja","Nein"]
[3532,"Rastenfeld","N","PLZ-Adressierung","extern","Ja","Ja"]
[3533,"Friedersbach","N","PLZ-Adressierung","extern","Ja","Nein"]
[3541,"Senftenberg","N","PLZ-Adressierung","extern","Ja","Ja"]
[3542,"Gföhl","N","PLZ-Adressierung","extern","Ja","Ja"]
[3543,"Krumau am Kamp","N","PLZ-Adressierung","extern","Ja","Nein"]
[3544,"Idolsberg","N","PLZ-Adressierung","extern","Ja","Nein"]
[3550,"Langenlois","N","PLZ-Adressierung","extern","Ja","Ja"]
[3552,"Lengenfeld","N","PLZ-Adressierung","extern","Ja","Ja"]
[3553,"Schiltern","N","PLZ-Adressierung","extern","Ja","Ja"]
[3561,"Zöbing","N","PLZ-Adressierung","extern","Ja","Nein"]
[3562,"Schönberg","N","PLZ-Adressierung","extern","Ja","Nein"]
[3564,"Plank am Kamp","N","PLZ-Adressierung","extern","Ja","Nein"]
[3571,"Gars am Kamp","N","PLZ-Adressierung","extern","Ja","Ja"]
[3572,"St. Leonhard am Hornerwald","N","PLZ-Adressierung","extern","Ja","Nein"]
[3573,"Rosenburg","N","PLZ-Adressierung","extern","Ja","Nein"]
[3580,"Horn","N","PLZ-Adressierung","extern","Ja","Ja"]
[3591,"Altenburg","N","PLZ-Adressierung","extern","Ja","Nein"]
[3592,"Röhrenbach","N","PLZ-Adressierung","extern","Ja","Nein"]
[3593,"Neupölla","N","PLZ-Adressierung","extern","Ja","Ja"]
[3594,"Franzen","N","PLZ-Adressierung","extern","Ja","Nein"]
[3595,"Brunn an der Wild","N","PLZ-Adressierung","extern","Ja","Nein"]
[3601,"Dürnstein","N","PLZ-Adressierung","extern","Ja","Nein"]
[3602,"Rossatz","N","PLZ-Adressierung","extern","Ja","Nein"]
[3610,"Weißenkirchen in der Wachau","N","PLZ-Adressierung","extern","Ja","Ja"]
[3611,"Großheinrichschlag","N","PLZ-Adressierung","extern","Ja","Ja"]
[3613,"Albrechtsberg an der Großen Krems","N","PLZ-Adressierung","extern","Ja","Nein"]
[3620,"Spitz","N","PLZ-Adressierung","extern","Ja","Ja"]
[3621,"Mitterarnsdorf","N","PLZ-Adressierung","extern","Ja","Nein"]
[3622,"Mühldorf","N","PLZ-Adressierung","extern","Ja","Ja"]
[3623,"Kottes","N","PLZ-Adressierung","extern","Ja","Nein"]
[3631,"Ottenschlag","N","PLZ-Adressierung","extern","Ja","Ja"]
[3632,"Traunstein","N","PLZ-Adressierung","extern","Ja","Ja"]
[3633,"Schönbach","N","PLZ-Adressierung","extern","Ja","Nein"]
[3641,"Aggsbach Markt","N","PLZ-Adressierung","extern","Ja","Nein"]
[3642,"Aggsbach Dorf","N","PLZ-Adressierung","extern","Ja","Nein"]
[3643,"Maria Laach am Jauerling","N","PLZ-Adressierung","extern","Ja","Ja"]
[3644,"Emmersdorf an der Donau","N","PLZ-Adressierung","extern","Ja","Nein"]
[3650,"Pöggstall","N","PLZ-Adressierung","extern","Ja","Ja"]
[3652,"Leiben","N","PLZ-Adressierung","extern","Ja","Nein"]
[3653,"Weiten","N","PLZ-Adressierung","extern","Ja","Ja"]
[3654,"Raxendorf","N","PLZ-Adressierung","extern","Ja","Ja"]
[3660,"Klein-Pöchlarn","N","PLZ-Adressierung","extern","Ja","Nein"]
[3661,"Artstetten","N","PLZ-Adressierung","extern","Ja","Ja"]
[3662,"Münichreith","N","PLZ-Adressierung","extern","Ja","Nein"]
[3663,"Laimbach am Ostrong","N","PLZ-Adressierung","extern","Ja","Nein"]
[3664,"Martinsberg","N","PLZ-Adressierung","extern","Ja","Ja"]
[3665,"Gutenbrunn","N","PLZ-Adressierung","extern","Ja","Nein"]
[3671,"Marbach an der Donau","N","PLZ-Adressierung","extern","Ja","Ja"]
[3672,"Maria Taferl","N","PLZ-Adressierung","extern","Ja","Ja"]
[3680,"Persenbeug","N","PLZ-Adressierung","extern","Ja","Ja"]
[3683,"Yspertal","N","PLZ-Adressierung","extern","Ja","Ja"]
[3684,"St. Oswald","N","PLZ-Adressierung","extern","Ja","Nein"]
[3691,"Nöchling","N","PLZ-Adressierung","extern","Ja","Nein"]
[3701,"Großweikersdorf","N","PLZ-Adressierung","extern","Ja","Ja"]
[3702,"Niederrußbach","N","PLZ-Adressierung","extern","Ja","Nein"]
[3704,"Glaubendorf","N","PLZ-Adressierung","extern","Ja","Nein"]
[3710,"Ziersdorf","N","PLZ-Adressierung","extern","Ja","Ja"]
[3711,"Großmeiseldorf","N","PLZ-Adressierung","extern","Ja","Nein"]
[3712,"Maissau","N","PLZ-Adressierung","extern","Ja","Ja"]
[3713,"Harmannsdorf","N","PLZ-Adressierung","extern","Ja","Nein"]
[3714,"Sitzendorf an der Schmida","N","PLZ-Adressierung","extern","Ja","Nein"]
[3720,"Ravelsbach","N","PLZ-Adressierung","extern","Ja","Nein"]
[3721,"Limberg","N","PLZ-Adressierung","extern","Ja","Nein"]
[3722,"Straning","N","PLZ-Adressierung","extern","Ja","Nein"]
[3730,"Eggenburg","N","PLZ-Adressierung","extern","Ja","Ja"]
[3741,"Pulkau","N","PLZ-Adressierung","extern","Ja","Ja"]
[3742,"Theras","N","PLZ-Adressierung","extern","Ja","Nein"]
[3743,"Röschitz","N","PLZ-Adressierung","extern","Ja","Nein"]
[3744,"Stockern","N","PLZ-Adressierung","extern","Ja","Nein"]
[3751,"Sigmundsherberg","N","PLZ-Adressierung","extern","Ja","Ja"]
[3752,"Walkenstein","N","PLZ-Adressierung","extern","Ja","Nein"]
[3753,"Hötzelsdorf","N","PLZ-Adressierung","extern","Ja","Nein"]
[3754,"Irnfritz","N","PLZ-Adressierung","extern","Ja","Nein"]
[3761,"Messern","N","PLZ-Adressierung","extern","Ja","Nein"]
[3762,"Ludweis","N","PLZ-Adressierung","extern","Ja","Nein"]
[3763,"Japons","N","PLZ-Adressierung","extern","Ja","Ja"]
[3800,"Göpfritz an der Wild","N","PLZ-Adressierung","extern","Ja","Nein"]
[3804,"Allentsteig","N","PLZ-Adressierung","extern","Ja","Ja"]
[3811,"Kirchberg an der Wild","N","PLZ-Adressierung","extern","Ja","Nein"]
[3812,"Groß Siegharts","N","PLZ-Adressierung","extern","Ja","Ja"]
[3813,"Dietmanns","N","PLZ-Adressierung","extern","Ja","Nein"]
[3814,"Aigen","N","PLZ-Adressierung","extern","Ja","Nein"]
[3820,"Raabs an der Thaya","N","PLZ-Adressierung","extern","Ja","Ja"]
[3822,"Karlstein an der Thaya","N","PLZ-Adressierung","extern","Ja","Nein"]
[3823,"Weikertschlag an der Thaya","N","PLZ-Adressierung","extern","Ja","Nein"]
[3824,"Großau","N","PLZ-Adressierung","extern","Ja","Nein"]
[3830,"Waidhofen an der Thaya","N","PLZ-Adressierung","extern","Ja","Ja"]
[3834,"Pfaffenschlag bei Waidhofen an der Thaya","N","PLZ-Adressierung","extern","Ja","Nein"]
[3841,"Windigsteig","N","PLZ-Adressierung","extern","Ja","Nein"]
[3842,"Thaya","N","PLZ-Adressierung","extern","Ja","Nein"]
[3843,"Dobersberg","N","PLZ-Adressierung","extern","Ja","Ja"]
[3844,"Waldkirchen an der Thaya","N","PLZ-Adressierung","extern","Ja","Nein"]
[3851,"Kautzen","N","PLZ-Adressierung","extern","Ja","Nein"]
[3852,"Gastern","N","PLZ-Adressierung","extern","Ja","Ja"]
[3860,"Heidenreichstein","N","PLZ-Adressierung","extern","Ja","Ja"]
[3861,"Eggern","N","PLZ-Adressierung","extern","Ja","Nein"]
[3862,"Eisgarn","N","PLZ-Adressierung","extern","Ja","Nein"]
[3863,"Reingers","N","PLZ-Adressierung","extern","Ja","Nein"]
[3871,"Nagelberg","N","PLZ-Adressierung","extern","Ja","Ja"]
[3872,"Langegg","N","PLZ-Adressierung","extern","Ja","Nein"]
[3873,"Brand","N","PLZ-Adressierung","extern","Ja","Nein"]
[3874,"Litschau","N","PLZ-Adressierung","extern","Ja","Ja"]
[3900,"Schwarzenau","N","PLZ-Adressierung","extern","Ja","Ja"]
[3902,"Vitis","N","PLZ-Adressierung","extern","Ja","Ja"]
[3903,"Echsenbach","N","PLZ-Adressierung","extern","Ja","Ja"]
[3910,"Zwettl","N","PLZ-Adressierung","extern","Ja","Ja"]
[3911,"Rappottenstein","N","PLZ-Adressierung","extern","Ja","Ja"]
[3912,"Grafenschlag","N","PLZ-Adressierung","extern","Ja","Nein"]
[3913,"Großgöttfritz","N","PLZ-Adressierung","extern","Ja","Nein"]
[3914,"Waldhausen","N","PLZ-Adressierung","extern","Ja","Nein"]
[3920,"Groß Gerungs","N","PLZ-Adressierung","extern","Ja","Ja"]
[3921,"Langschlag","N","PLZ-Adressierung","extern","Ja","Nein"]
[3922,"Großschönau","N","PLZ-Adressierung","extern","Ja","Nein"]
[3923,"Jagenbach","N","PLZ-Adressierung","extern","Ja","Nein"]
[3924,"Rosenau Schloß","N","PLZ-Adressierung","extern","Ja","Nein"]
[3925,"Arbesbach","N","PLZ-Adressierung","extern","Ja","Ja"]
[3931,"Schweiggers","N","PLZ-Adressierung","extern","Ja","Ja"]
[3932,"Kirchberg am Walde","N","PLZ-Adressierung","extern","Ja","Nein"]
[3942,"Hirschbach","N","PLZ-Adressierung","extern","Ja","Nein"]
[3943,"Schrems","N","PLZ-Adressierung","extern","Ja","Ja"]
[3944,"Pürbach","N","PLZ-Adressierung","extern","Ja","Nein"]
[3945,"Hoheneich","N","PLZ-Adressierung","extern","Ja","Nein"]
[3950,"Gmünd","N","PLZ-Adressierung","extern","Ja","Ja"]
[3961,"Waldenstein","N","PLZ-Adressierung","extern","Ja","Nein"]
[3962,"Heinrichs bei Weitra","N","PLZ-Adressierung","extern","Ja","Nein"]
[3970,"Weitra","N","PLZ-Adressierung","extern","Ja","Ja"]
[3971,"St. Martin","N","PLZ-Adressierung","extern","Ja","Nein"]
[3972,"Bad Großpertholz","N","PLZ-Adressierung","extern","Ja","Ja"]
[3973,"Karlstift","N","PLZ-Adressierung","extern","Ja","Nein"]
[4010,"Linz, Donau","O","PLZ-Postfach","extern","Nein","Ja"]
[4013,"Linz, Donau","O","PLZ-Postfach","extern","Nein","Ja"]
[4014,"Linz, Donau","O","PLZ-Postfach","extern","Nein","Ja"]
[4015,"Linz, Donau","O","PLZ-Postfach","extern","Nein","Ja"]
[4017,"Linz, Donau","O","PLZ-Postfach","extern","Nein","Ja"]
[4018,"Linz, Donau","O","PLZ-Postfach","extern","Nein","Ja"]
[4020,"Linz","O","PLZ-Adressierung","extern","Ja","Ja"]
[4021,"Linz, Donau Postfach","O","PLZ-Postfach","extern","Nein","Ja"]
[4025,"Linz, Donau","O","PLZ-Postfach","extern","Nein","Ja"]
[4026,"Linz, Donau","O","PLZ-Postfach","extern","Nein","Ja"]
[4029,"Linz, Donau","O","PLZ-Postfach","extern","Nein","Ja"]
[4030,"Linz","O","PLZ-Adressierung","extern","Ja","Ja"]
[4031,"Linz, Donau Postfach","O","PLZ-Postfach","extern","Nein","Ja"]
[4033,"Linz-Ebelsberg","O","PLZ-Postfach","extern","Nein","Ja"]
[4034,"Linz, Donau","O","PLZ-Postfach","extern","Nein","Ja"]
[4040,"Linz","O","PLZ-Adressierung","extern","Ja","Ja"]
[4041,"Linz, Donau Postfach","O","PLZ-Postfach","extern","Nein","Ja"]
[4044,"Linz, Donau","O","PLZ-Postfach","extern","Nein","Ja"]
[4046,"Linz, Donau","O","PLZ-Postfach","extern","Nein","Ja"]
[4048,"Puchenau","O","PLZ-Adressierung","extern","Ja","Ja"]
[4050,"Traun","O","PLZ-Adressierung","extern","Ja","Ja"]
[4052,"Ansfelden","O","PLZ-Adressierung","extern","Ja","Ja"]
[4053,"Haid","O","PLZ-Adressierung","extern","Ja","Ja"]
[4055,"Pucking","O","PLZ-Adressierung","extern","Ja","Nein"]
[4059,"Leonding","O","PLZ-Postfach","extern","Nein","Ja"]
[4060,"Leonding","O","PLZ-Adressierung","extern","Ja","Ja"]
[4061,"Pasching","O","PLZ-Adressierung","extern","Ja","Ja"]
[4062,"Thening","O","PLZ-Adressierung","extern","Ja","Nein"]
[4063,"Hörsching","O","PLZ-Adressierung","extern","Ja","Ja"]
[4064,"Oftering","O","PLZ-Adressierung","extern","Ja","Ja"]
[4066,"Pasching","O","PLZ-Postfach","extern","Nein","Ja"]
[4069,"Leonding","O","PLZ-Postfach","extern","Nein","Ja"]
[4070,"Eferding","O","PLZ-Adressierung","extern","Ja","Ja"]
[4072,"Alkoven","O","PLZ-Adressierung","extern","Ja","Ja"]
[4073,"Wilhering","O","PLZ-Adressierung","extern","Ja","Ja"]
[4074,"Stroheim","O","PLZ-Adressierung","extern","Ja","Nein"]
[4075,"Breitenaich","O","PLZ-Adressierung","extern","Ja","Nein"]
[4076,"St. Marienkirchen an der Polsenz","O","PLZ-Adressierung","extern","Ja","Nein"]
[4081,"Hartkirchen","O","PLZ-Adressierung","extern","Ja","Ja"]
[4082,"Aschach an der Donau","O","PLZ-Adressierung","extern","Ja","Nein"]
[4083,"Haibach ob der Donau","O","PLZ-Adressierung","extern","Ja","Ja"]
[4084,"St. Agatha","O","PLZ-Adressierung","extern","Ja","Nein"]
[4085,"Wesenufer","O","PLZ-Adressierung","extern","Ja","Ja"]
[4090,"Engelhartszell","O","PLZ-Adressierung","extern","Ja","Ja"]
[4091,"Vichtenstein","O","PLZ-Adressierung","extern","Ja","Nein"]
[4092,"Esternberg","O","PLZ-Adressierung","extern","Ja","Ja"]
[4100,"Ottensheim","O","PLZ-Adressierung","extern","Ja","Ja"]
[4101,"Feldkirchen an der Donau","O","PLZ-Adressierung","extern","Ja","Ja"]
[4111,"Walding","O","PLZ-Adressierung","extern","Ja","Ja"]
[4112,"Rottenegg","O","PLZ-Adressierung","extern","Ja","Nein"]
[4113,"St. Martin im Mühlkreis","O","PLZ-Adressierung","extern","Ja","Ja"]
[4114,"Neuhaus an der Donau","O","PLZ-Adressierung","extern","Ja","Nein"]
[4115,"Kleinzell im Mühlkreis","O","PLZ-Adressierung","extern","Ja","Nein"]
[4120,"Neufelden","O","PLZ-Adressierung","extern","Ja","Ja"]
[4121,"Altenfelden","O","PLZ-Adressierung","extern","Ja","Ja"]
[4122,"Arnreit","O","PLZ-Adressierung","extern","Ja","Nein"]
[4131,"Obermühl","O","PLZ-Adressierung","extern","Ja","Nein"]
[4132,"Lembach im Mühlkreis","O","PLZ-Adressierung","extern","Ja","Ja"]
[4133,"Niederkappel","O","PLZ-Adressierung","extern","Ja","Nein"]
[4134,"Putzleinsdorf","O","PLZ-Adressierung","extern","Ja","Nein"]
[4141,"Pfarrkirchen im Mühlkreis","O","PLZ-Adressierung","extern","Ja","Nein"]
[4142,"Hofkirchen im Mühlkreis","O","PLZ-Adressierung","extern","Ja","Ja"]
[4143,"Neustift im Mühlkreis","O","PLZ-Adressierung","extern","Ja","Ja"]
[4144,"Oberkappel","O","PLZ-Adressierung","extern","Ja","Nein"]
[4150,"Rohrbach in Oberösterreich","O","PLZ-Adressierung","extern","Ja","Ja"]
[4152,"Sarleinsbach","O","PLZ-Adressierung","extern","Ja","Nein"]
[4153,"Peilstein im Mühlviertel","O","PLZ-Adressierung","extern","Ja","Ja"]
[4154,"Kollerschlag","O","PLZ-Adressierung","extern","Ja","Nein"]
[4160,"Aigen im Mühlkreis","O","PLZ-Adressierung","extern","Ja","Ja"]
[4161,"Ulrichsberg","O","PLZ-Adressierung","extern","Ja","Ja"]
[4162,"Julbach","O","PLZ-Adressierung","extern","Ja","Nein"]
[4163,"Klaffer am Hochficht","O","PLZ-Adressierung","extern","Ja","Nein"]
[4164,"Schwarzenberg am Böhmerwald","O","PLZ-Adressierung","extern","Ja","Nein"]
[4170,"Haslach an der Mühl","O","PLZ-Adressierung","extern","Ja","Ja"]
[4171,"St. Peter am Wimberg","O","PLZ-Adressierung","extern","Ja","Ja"]
[4172,"St. Johann am Wimberg","O","PLZ-Adressierung","extern","Ja","Nein"]
[4173,"St. Veit im Mühlkreis","O","PLZ-Adressierung","extern","Ja","Nein"]
[4174,"Niederwaldkirchen","O","PLZ-Adressierung","extern","Ja","Nein"]
[4175,"Herzogsdorf","O","PLZ-Adressierung","extern","Ja","Ja"]
[4180,"Zwettl an der Rodl","O","PLZ-Adressierung","extern","Ja","Ja"]
[4181,"Oberneukirchen","O","PLZ-Adressierung","extern","Ja","Ja"]
[4182,"Waxenberg","O","PLZ-Adressierung","extern","Ja","Nein"]
[4183,"Traberg","O","PLZ-Adressierung","extern","Ja","Nein"]
[4184,"Helfenberg","O","PLZ-Adressierung","extern","Ja","Nein"]
[4190,"Bad Leonfelden","O","PLZ-Adressierung","extern","Ja","Ja"]
[4191,"Vorderweißenbach","O","PLZ-Adressierung","extern","Ja","Nein"]
[4192,"Schenkenfelden","O","PLZ-Adressierung","extern","Ja","Ja"]
[4193,"Reichenthal","O","PLZ-Adressierung","extern","Ja","Ja"]
[4201,"Gramastetten","O","PLZ-Adressierung","extern","Ja","Ja"]
[4202,"Hellmonsödt","O","PLZ-Adressierung","extern","Ja","Ja"]
[4203,"Altenberg bei Linz","O","PLZ-Adressierung","extern","Ja","Ja"]
[4204,"Reichenau im Mühlkreis","O","PLZ-Adressierung","extern","Ja","Nein"]
[4209,"Engerwitzdorf","O","PLZ-Adressierung","extern","Ja","Nein"]
[4210,"Gallneukirchen","O","PLZ-Adressierung","extern","Ja","Ja"]
[4211,"Alberndorf in der Riedmark","O","PLZ-Adressierung","extern","Ja","Ja"]
[4212,"Neumarkt im Mühlkreis","O","PLZ-Adressierung","extern","Ja","Ja"]
[4221,"Steyregg","O","PLZ-Adressierung","extern","Ja","Ja"]
[4222,"St. Georgen an der Gusen","O","PLZ-Adressierung","extern","Ja","Ja"]
[4223,"Katsdorf","O","PLZ-Adressierung","extern","Ja","Ja"]
[4224,"Wartberg ob der Aist","O","PLZ-Adressierung","extern","Ja","Ja"]
[4230,"Pregarten","O","PLZ-Adressierung","extern","Ja","Ja"]
[4231,"Untergaisbach","O","PLZ-Adressierung","extern","Ja","Nein"]
[4232,"Hagenberg im Mühlkreis","O","PLZ-Adressierung","extern","Ja","Ja"]
[4240,"Freistadt","O","PLZ-Adressierung","extern","Ja","Ja"]
[4242,"Hirschbach im Mühlkreis","O","PLZ-Adressierung","extern","Ja","Ja"]
[4251,"Sandl","O","PLZ-Adressierung","extern","Ja","Ja"]
[4252,"Liebenau","O","PLZ-Adressierung","extern","Ja","Nein"]
[4261,"Rainbach im Mühlkreis","O","PLZ-Adressierung","extern","Ja","Ja"]
[4262,"Leopoldschlag","O","PLZ-Adressierung","extern","Ja","Nein"]
[4263,"Windhaag bei Freistadt","O","PLZ-Adressierung","extern","Ja","Ja"]
[4264,"Grünbach","O","PLZ-Adressierung","extern","Ja","Nein"]
[4271,"St. Oswald bei Freistadt","O","PLZ-Adressierung","extern","Ja","Nein"]
[4272,"Weitersfelden","O","PLZ-Adressierung","extern","Ja","Nein"]
[4273,"Unterweißenbach","O","PLZ-Adressierung","extern","Ja","Ja"]
[4274,"Schönau im Mühlkreis","O","PLZ-Adressierung","extern","Ja","Nein"]
[4280,"Königswiesen","O","PLZ-Adressierung","extern","Ja","Ja"]
[4281,"Mönchdorf","O","PLZ-Adressierung","extern","Ja","Nein"]
[4282,"Pierbach","O","PLZ-Adressierung","extern","Ja","Nein"]
[4283,"Bad Zell","O","PLZ-Adressierung","extern","Ja","Ja"]
[4284,"Tragwein","O","PLZ-Adressierung","extern","Ja","Nein"]
[4291,"Lasberg","O","PLZ-Adressierung","extern","Ja","Ja"]
[4292,"Kefermarkt","O","PLZ-Adressierung","extern","Ja","Nein"]
[4293,"Gutau","O","PLZ-Adressierung","extern","Ja","Ja"]
[4294,"St. Leonhard bei Freistadt","O","PLZ-Adressierung","extern","Ja","Nein"]
[4300,"St. Valentin","N","PLZ-Adressierung","extern","Ja","Ja"]
[4303,"St. Pantaleon","N","PLZ-Adressierung","extern","Ja","Nein"]
[4310,"Mauthausen","O","PLZ-Adressierung","extern","Ja","Ja"]
[4311,"Schwertberg","O","PLZ-Adressierung","extern","Ja","Ja"]
[4312,"Ried in der Riedmark","O","PLZ-Adressierung","extern","Ja","Ja"]
[4320,"Perg","O","PLZ-Adressierung","extern","Ja","Ja"]
[4322,"Windhaag bei Perg","O","PLZ-Adressierung","extern","Ja","Nein"]
[4323,"Münzbach","O","PLZ-Adressierung","extern","Ja","Nein"]
[4324,"Rechberg","O","PLZ-Adressierung","extern","Ja","Nein"]
[4331,"Naarn","O","PLZ-Adressierung","extern","Ja","Ja"]
[4332,"Au an der Donau","O","PLZ-Adressierung","extern","Ja","Nein"]
[4341,"Arbing","O","PLZ-Adressierung","extern","Ja","Nein"]
[4342,"Baumgartenberg","O","PLZ-Adressierung","extern","Ja","Nein"]
[4343,"Mitterkirchen","O","PLZ-Adressierung","extern","Ja","Ja"]
[4351,"Saxen","O","PLZ-Adressierung","extern","Ja","Nein"]
[4352,"Klam","O","PLZ-Adressierung","extern","Ja","Nein"]
[4360,"Grein","O","PLZ-Adressierung","extern","Ja","Ja"]
[4362,"Bad Kreuzen","O","PLZ-Adressierung","extern","Ja","Ja"]
[4363,"Pabneukirchen","O","PLZ-Adressierung","extern","Ja","Ja"]
[4364,"St. Thomas","O","PLZ-Adressierung","extern","Ja","Nein"]
[4371,"Dimbach","O","PLZ-Adressierung","extern","Ja","Nein"]
[4372,"St. Georgen am Walde","O","PLZ-Adressierung","extern","Ja","Ja"]
[4381,"St. Nikola an der Donau","O","PLZ-Adressierung","extern","Ja","Nein"]
[4382,"Sarmingstein","O","PLZ-Adressierung","extern","Ja","Nein"]
[4391,"Waldhausen im Strudengau","O","PLZ-Adressierung","extern","Ja","Ja"]
[4392,"Dorfstetten","N","PLZ-Adressierung","extern","Ja","Nein"]
[4400,"Steyr","O","PLZ-Adressierung","extern","Ja","Ja"]
[4401,"Steyr Postfach","O","PLZ-Postfach","extern","Nein","Ja"]
[4402,"Steyr","O","PLZ-Postfach","extern","Nein","Ja"]
[4403,"Steyr","O","PLZ-Postfach","extern","Nein","Ja"]
[4405,"Steyr-Münichholz","O","PLZ-Postfach","extern","Nein","Ja"]
[4406,"Steyr","O","PLZ-Postfach","extern","Nein","Ja"]
[4407,"Steyr-Gleink","O","PLZ-Adressierung","extern","Ja","Ja"]
[4411,"Christkindl","O","PLZ-Postfach","extern","Nein","Ja"]
[4421,"Aschach an der Steyr","O","PLZ-Adressierung","extern","Ja","Nein"]
[4431,"Haidershofen","N","PLZ-Adressierung","extern","Ja","Ja"]
[4432,"Ernsthofen","N","PLZ-Adressierung","extern","Ja","Nein"]
[4441,"Behamberg","N","PLZ-Adressierung","extern","Ja","Nein"]
[4442,"Kleinraming","O","PLZ-Adressierung","extern","Ja","Nein"]
[4443,"Maria Neustift","O","PLZ-Adressierung","extern","Ja","Ja"]
[4451,"Garsten","O","PLZ-Adressierung","extern","Ja","Ja"]
[4452,"Ternberg","O","PLZ-Adressierung","extern","Ja","Ja"]
[4453,"Trattenbach","O","PLZ-Adressierung","extern","Ja","Nein"]
[4460,"Losenstein","O","PLZ-Adressierung","extern","Ja","Nein"]
[4461,"Laussa","O","PLZ-Adressierung","extern","Ja","Nein"]
[4462,"Reichraming","O","PLZ-Adressierung","extern","Ja","Nein"]
[4463,"Großraming","O","PLZ-Adressierung","extern","Ja","Ja"]
[4464,"Kleinreifling","O","PLZ-Adressierung","extern","Ja","Nein"]
[4470,"Enns","O","PLZ-Adressierung","extern","Ja","Ja"]
[4481,"Asten","O","PLZ-Adressierung","extern","Ja","Ja"]
[4482,"Ennsdorf","N","PLZ-Adressierung","extern","Ja","Nein"]
[4483,"Hargelsberg","O","PLZ-Adressierung","extern","Ja","Nein"]
[4484,"Kronstorf","O","PLZ-Adressierung","extern","Ja","Ja"]
[4490,"St. Florian","O","PLZ-Adressierung","extern","Ja","Ja"]
[4491,"Niederneukirchen","O","PLZ-Adressierung","extern","Ja","Ja"]
[4492,"Hofkirchen im Traunkreis","O","PLZ-Adressierung","extern","Ja","Nein"]
[4493,"Wolfern","O","PLZ-Adressierung","extern","Ja","Nein"]
[4501,"Neuhofen an der Krems","O","PLZ-Adressierung","extern","Ja","Ja"]
[4502,"St. Marien","O","PLZ-Adressierung","extern","Ja","Ja"]
[4511,"Allhaming","O","PLZ-Adressierung","extern","Ja","Nein"]
[4521,"Schiedlberg","O","PLZ-Adressierung","extern","Ja","Nein"]
[4522,"Sierning","O","PLZ-Adressierung","extern","Ja","Ja"]
[4523,"Neuzeug","O","PLZ-Adressierung","extern","Ja","Nein"]
[4531,"Kematen an der Krems","O","PLZ-Adressierung","extern","Ja","Ja"]
[4532,"Rohr im Kremstal","O","PLZ-Adressierung","extern","Ja","Nein"]
[4533,"Piberbach","O","PLZ-Adressierung","extern","Ja","Nein"]
[4540,"Bad Hall","O","PLZ-Adressierung","extern","Ja","Ja"]
[4541,"Adlwang","O","PLZ-Adressierung","extern","Ja","Nein"]
[4542,"Nußbach","O","PLZ-Adressierung","extern","Ja","Nein"]
[4550,"Kremsmünster","O","PLZ-Adressierung","extern","Ja","Ja"]
[4551,"Ried im Traunkreis","O","PLZ-Adressierung","extern","Ja","Nein"]
[4552,"Wartberg an der Krems","O","PLZ-Adressierung","extern","Ja","Ja"]
[4553,"Schlierbach","O","PLZ-Adressierung","extern","Ja","Nein"]
[4560,"Kirchdorf an der Krems","O","PLZ-Adressierung","extern","Ja","Ja"]
[4562,"Steinbach am Ziehberg","O","PLZ-Adressierung","extern","Ja","Nein"]
[4563,"Micheldorf","O","PLZ-Adressierung","extern","Ja","Ja"]
[4564,"Klaus an der Pyhrnbahn","O","PLZ-Adressierung","extern","Ja","Nein"]
[4571,"Steyrling","O","PLZ-Adressierung","extern","Ja","Nein"]
[4572,"St. Pankraz","O","PLZ-Adressierung","extern","Ja","Nein"]
[4573,"Hinterstoder","O","PLZ-Adressierung","extern","Ja","Ja"]
[4574,"Vorderstoder","O","PLZ-Adressierung","extern","Ja","Nein"]
[4575,"Roßleithen","O","PLZ-Adressierung","extern","Ja","Nein"]
[4580,"Windischgarsten","O","PLZ-Adressierung","extern","Ja","Ja"]
[4581,"Rosenau am Hengstpaß","O","PLZ-Adressierung","extern","Ja","Nein"]
[4582,"Spital am Pyhrn","O","PLZ-Adressierung","extern","Ja","Ja"]
[4591,"Molln","O","PLZ-Adressierung","extern","Ja","Ja"]
[4592,"Leonstein","O","PLZ-Adressierung","extern","Ja","Nein"]
[4593,"Obergrünburg","O","PLZ-Adressierung","extern","Ja","Nein"]
[4594,"Grünburg","O","PLZ-Adressierung","extern","Ja","Ja"]
[4595,"Waldneukirchen","O","PLZ-Adressierung","extern","Ja","Nein"]
[4600,"Wels","O","PLZ-Adressierung","extern","Ja","Ja"]
[4601,"Wels","O","PLZ-Postfach","extern","Nein","Ja"]
[4602,"Wels Postfach","O","PLZ-Postfach","extern","Nein","Ja"]
[4603,"Wels","O","PLZ-Postfach","extern","Nein","Ja"]
[4604,"Wels","O","PLZ-Postfach","extern","Nein","Ja"]
[4605,"Wels","O","PLZ-Postfach","extern","Nein","Ja"]
[4606,"Wels","O","PLZ-Postfach","extern","Nein","Ja"]
[4607,"Wels","O","PLZ-Postfach","extern","Nein","Ja"]
[4609,"Thalheim bei Wels","O","PLZ-Postfach","extern","Nein","Ja"]
[4611,"Buchkirchen","O","PLZ-Adressierung","extern","Ja","Nein"]
[4612,"Scharten","O","PLZ-Adressierung","extern","Ja","Nein"]
[4613,"Mistelbach bei Wels","O","PLZ-Adressierung","extern","Ja","Nein"]
[4614,"Marchtrenk","O","PLZ-Adressierung","extern","Ja","Ja"]
[4615,"Holzhausen","O","PLZ-Adressierung","extern","Ja","Nein"]
[4616,"Weißkirchen","O","PLZ-Adressierung","extern","Ja","Nein"]
[4621,"Sipbachzell","O","PLZ-Adressierung","extern","Ja","Nein"]
[4622,"Eggendorf im Traunkreis","O","PLZ-Adressierung","extern","Ja","Nein"]
[4623,"Gunskirchen","O","PLZ-Adressierung","extern","Ja","Ja"]
[4624,"Pennewang","O","PLZ-Adressierung","extern","Ja","Nein"]
[4625,"Offenhausen","O","PLZ-Adressierung","extern","Ja","Nein"]
[4631,"Krenglbach","O","PLZ-Adressierung","extern","Ja","Nein"]
[4632,"Pichl bei Wels","O","PLZ-Adressierung","extern","Ja","Ja"]
[4633,"Kematen am Innbach","O","PLZ-Adressierung","extern","Ja","Nein"]
[4641,"Steinhaus","O","PLZ-Adressierung","extern","Ja","Nein"]
[4642,"Sattledt","O","PLZ-Adressierung","extern","Ja","Ja"]
[4643,"Pettenbach","O","PLZ-Adressierung","extern","Ja","Ja"]
[4644,"Scharnstein","O","PLZ-Adressierung","extern","Ja","Ja"]
[4645,"Grünau im Almtal","O","PLZ-Adressierung","extern","Ja","Nein"]
[4650,"Lambach","O","PLZ-Adressierung","extern","Ja","Ja"]
[4651,"Stadl-Paura","O","PLZ-Adressierung","extern","Ja","Ja"]
[4652,"Steinerkirchen an der Traun","O","PLZ-Adressierung","extern","Ja","Ja"]
[4653,"Eberstalzell","O","PLZ-Adressierung","extern","Ja","Nein"]
[4654,"Bad Wimsbach-Neydharting","O","PLZ-Adressierung","extern","Ja","Nein"]
[4655,"Vorchdorf","O","PLZ-Adressierung","extern","Ja","Ja"]
[4656,"Kirchham","O","PLZ-Adressierung","extern","Ja","Ja"]
[4661,"Roitham","O","PLZ-Adressierung","extern","Ja","Ja"]
[4662,"Steyrermühl","O","PLZ-Adressierung","extern","Ja","Nein"]
[4663,"Laakirchen","O","PLZ-Adressierung","extern","Ja","Ja"]
[4664,"Oberweis","O","PLZ-Adressierung","extern","Ja","Ja"]
[4671,"Neukirchen bei Lambach","O","PLZ-Adressierung","extern","Ja","Nein"]
[4672,"Bachmanning","O","PLZ-Adressierung","extern","Ja","Nein"]
[4673,"Gaspoltshofen","O","PLZ-Adressierung","extern","Ja","Ja"]
[4674,"Altenhof am Hausruck","O","PLZ-Adressierung","extern","Ja","Nein"]
[4675,"Weibern","O","PLZ-Adressierung","extern","Ja","Ja"]
[4676,"Aistersheim","O","PLZ-Adressierung","extern","Ja","Nein"]
[4680,"Haag am Hausruck","O","PLZ-Adressierung","extern","Ja","Ja"]
[4681,"Rottenbach","O","PLZ-Adressierung","extern","Ja","Nein"]
[4682,"Geboltskirchen","O","PLZ-Adressierung","extern","Ja","Nein"]
[4690,"Schwanenstadt","O","PLZ-Adressierung","extern","Ja","Ja"]
[4691,"Breitenschützing","O","PLZ-Adressierung","extern","Ja","Nein"]
[4692,"Niederthalheim","O","PLZ-Adressierung","extern","Ja","Nein"]
[4693,"Desselbrunn","O","PLZ-Adressierung","extern","Ja","Nein"]
[4694,"Ohlsdorf","O","PLZ-Adressierung","extern","Ja","Ja"]
[4701,"Bad Schallerbach","O","PLZ-Adressierung","extern","Ja","Ja"]
[4702,"Wallern an der Trattnach","O","PLZ-Adressierung","extern","Ja","Nein"]
[4707,"Schlüßlberg","O","PLZ-Adressierung","extern","Ja","Nein"]
[4710,"Grieskirchen","O","PLZ-Adressierung","extern","Ja","Ja"]
[4712,"Michaelnbach","O","PLZ-Adressierung","extern","Ja","Nein"]
[4713,"Gallspach","O","PLZ-Adressierung","extern","Ja","Ja"]
[4714,"Meggenhofen","O","PLZ-Adressierung","extern","Ja","Nein"]
[4715,"Taufkirchen an der Trattnach","O","PLZ-Adressierung","extern","Ja","Nein"]
[4716,"Hofkirchen an der Trattnach","O","PLZ-Adressierung","extern","Ja","Nein"]
[4720,"Neumarkt im Hausruckkreis","O","PLZ-Adressierung","extern","Ja","Ja"]
[4721,"Altschwendt","O","PLZ-Adressierung","extern","Ja","Nein"]
[4722,"Peuerbach","O","PLZ-Adressierung","extern","Ja","Ja"]
[4723,"Natternbach","O","PLZ-Adressierung","extern","Ja","Nein"]
[4724,"Neukirchen am Walde","O","PLZ-Adressierung","extern","Ja","Ja"]
[4725,"St. Aegidi","O","PLZ-Adressierung","extern","Ja","Nein"]
[4730,"Waizenkirchen","O","PLZ-Adressierung","extern","Ja","Ja"]
[4731,"Prambachkirchen","O","PLZ-Adressierung","extern","Ja","Ja"]
[4732,"St. Thomas","O","PLZ-Adressierung","extern","Ja","Nein"]
[4733,"Heiligenberg","O","PLZ-Adressierung","extern","Ja","Nein"]
[4741,"Wendling","O","PLZ-Adressierung","extern","Ja","Nein"]
[4742,"Pram","O","PLZ-Adressierung","extern","Ja","Nein"]
[4743,"Peterskirchen","O","PLZ-Adressierung","extern","Ja","Nein"]
[4751,"Dorf","O","PLZ-Adressierung","extern","Ja","Nein"]
[4752,"Riedau","O","PLZ-Adressierung","extern","Ja","Ja"]
[4753,"Taiskirchen im Innkreis","O","PLZ-Adressierung","extern","Ja","Ja"]
[4754,"Andrichsfurt","O","PLZ-Adressierung","extern","Ja","Nein"]
[4755,"Zell an der Pram","O","PLZ-Adressierung","extern","Ja","Nein"]
[4760,"Raab","O","PLZ-Adressierung","extern","Ja","Ja"]
[4761,"Enzenkirchen","O","PLZ-Adressierung","extern","Ja","Nein"]
[4762,"St. Willibald","O","PLZ-Adressierung","extern","Ja","Nein"]
[4770,"Andorf","O","PLZ-Adressierung","extern","Ja","Ja"]
[4771,"Sigharting","O","PLZ-Adressierung","extern","Ja","Nein"]
[4772,"Lambrechten","O","PLZ-Adressierung","extern","Ja","Nein"]
[4773,"Eggerding","O","PLZ-Adressierung","extern","Ja","Nein"]
[4774,"St. Marienkirchen bei Schärding","O","PLZ-Adressierung","extern","Ja","Nein"]
[4775,"Taufkirchen an der Pram","O","PLZ-Adressierung","extern","Ja","Ja"]
[4776,"Diersbach","O","PLZ-Adressierung","extern","Ja","Nein"]
[4777,"Mayrhof","O","PLZ-Adressierung","extern","Ja","Nein"]
[4780,"Schärding","O","PLZ-Adressierung","extern","Ja","Ja"]
[4782,"St. Florian am Inn","O","PLZ-Adressierung","extern","Ja","Nein"]
[4783,"Wernstein am Inn","O","PLZ-Adressierung","extern","Ja","Nein"]
[4784,"Schardenberg","O","PLZ-Adressierung","extern","Ja","Ja"]
[4785,"Freinberg","O","PLZ-Adressierung","extern","Ja","Nein"]
[4786,"Brunnenthal","O","PLZ-Adressierung","extern","Ja","Nein"]
[4791,"Rainbach im Innkreis","O","PLZ-Adressierung","extern","Ja","Ja"]
[4792,"Münzkirchen","O","PLZ-Adressierung","extern","Ja","Ja"]
[4793,"St. Roman","O","PLZ-Adressierung","extern","Ja","Nein"]
[4794,"Kopfing im Innkreis","O","PLZ-Adressierung","extern","Ja","Nein"]
[4800,"Attnang-Puchheim","O","PLZ-Adressierung","extern","Ja","Ja"]
[4801,"Traunkirchen","O","PLZ-Adressierung","extern","Ja","Nein"]
[4802,"Ebensee","O","PLZ-Adressierung","extern","Ja","Ja"]
[4810,"Gmunden","O","PLZ-Adressierung","extern","Ja","Ja"]
[4812,"Pinsdorf","O","PLZ-Adressierung","extern","Ja","Ja"]
[4813,"Altmünster","O","PLZ-Adressierung","extern","Ja","Ja"]
[4814,"Neukirchen","O","PLZ-Adressierung","extern","Ja","Ja"]
[4815,"Ort bei Gmunden","O","PLZ-Postfach","extern","Nein","Ja"]
[4816,"Gschwandt","O","PLZ-Adressierung","extern","Ja","Ja"]
[4817,"St. Konrad","O","PLZ-Adressierung","extern","Ja","Nein"]
[4819,"Gmunden","O","PLZ-Postfach","extern","Nein","Ja"]
[4820,"Bad Ischl","O","PLZ-Adressierung","extern","Ja","Ja"]
[4821,"Lauffen","O","PLZ-Adressierung","extern","Ja","Nein"]
[4822,"Bad Goisern","O","PLZ-Adressierung","extern","Ja","Ja"]
[4823,"Steeg","O","PLZ-Adressierung","extern","Ja","Nein"]
[4824,"Gosau","O","PLZ-Adressierung","extern","Ja","Ja"]
[4825,"Gosau-Hintertal","O","PLZ-Adressierung","extern","Ja","Nein"]
[4829,"Bad Ischl","O","PLZ-Postfach","extern","Nein","Ja"]
[4830,"Hallstatt","O","PLZ-Adressierung","extern","Ja","Nein"]
[4831,"Obertraun","O","PLZ-Adressierung","extern","Ja","Nein"]
[4840,"Vöcklabruck","O","PLZ-Adressierung","extern","Ja","Ja"]
[4841,"Ungenach","O","PLZ-Adressierung","extern","Ja","Nein"]
[4842,"Zell am Pettenfirst","O","PLZ-Adressierung","extern","Ja","Nein"]
[4843,"Ampflwang","O","PLZ-Adressierung","extern","Ja","Ja"]
[4844,"Regau","O","PLZ-Adressierung","extern","Ja","Ja"]
[4845,"Rutzenmoos","O","PLZ-Adressierung","extern","Ja","Nein"]
[4850,"Timelkam","O","PLZ-Adressierung","extern","Ja","Ja"]
[4851,"Gampern","O","PLZ-Adressierung","extern","Ja","Nein"]
[4852,"Weyregg am Attersee","O","PLZ-Adressierung","extern","Ja","Nein"]
[4853,"Steinbach am Attersee","O","PLZ-Adressierung","extern","Ja","Ja"]
[4854,"Weißenbach","O","PLZ-Adressierung","extern","Ja","Nein"]
[4860,"Lenzing","O","PLZ-Adressierung","extern","Ja","Ja"]
[4861,"Schörfling","O","PLZ-Adressierung","extern","Ja","Ja"]
[4863,"Seewalchen am Attersee","O","PLZ-Adressierung","extern","Ja","Ja"]
[4864,"Attersee","O","PLZ-Adressierung","extern","Ja","Nein"]
[4865,"Nußdorf am Attersee","O","PLZ-Adressierung","extern","Ja","Ja"]
[4866,"Unterach","O","PLZ-Adressierung","extern","Ja","Ja"]
[4870,"Vöcklamarkt","O","PLZ-Adressierung","extern","Ja","Ja"]
[4871,"Zipf","O","PLZ-Adressierung","extern","Ja","Ja"]
[4872,"Neukirchen an der Vöckla","O","PLZ-Adressierung","extern","Ja","Nein"]
[4873,"Frankenburg am Hausruck","O","PLZ-Adressierung","extern","Ja","Ja"]
[4874,"Pramet","O","PLZ-Historisch","intern","Nein","Nein"]
[4880,"St. Georgen im Attergau","O","PLZ-Adressierung","extern","Ja","Ja"]
[4881,"Straß im Attergau","O","PLZ-Adressierung","extern","Ja","Nein"]
[4882,"Oberwang","O","PLZ-Adressierung","extern","Ja","Nein"]
[4890,"Frankenmarkt","O","PLZ-Adressierung","extern","Ja","Ja"]
[4891,"Pöndorf","O","PLZ-Adressierung","extern","Ja","Nein"]
[4892,"Fornach","O","PLZ-Adressierung","extern","Ja","Nein"]
[4893,"Zell am Moos","O","PLZ-Adressierung","extern","Ja","Ja"]
[4894,"Oberhofen am Irrsee","O","PLZ-Adressierung","extern","Ja","Ja"]
[4901,"Ottnang","O","PLZ-Adressierung","extern","Ja","Ja"]
[4902,"Wolfsegg am Hausruck","O","PLZ-Adressierung","extern","Ja","Nein"]
[4904,"Atzbach","O","PLZ-Adressierung","extern","Ja","Nein"]
[4905,"Thomasroith","O","PLZ-Adressierung","extern","Ja","Nein"]
[4906,"Eberschwang","O","PLZ-Adressierung","extern","Ja","Ja"]
[4910,"Ried im Innkreis","O","PLZ-Adressierung","extern","Ja","Ja"]
[4912,"Neuhofen im Innkreis","O","PLZ-Adressierung","extern","Ja","Nein"]
[4920,"Schildorn","O","PLZ-Adressierung","extern","Ja","Nein"]
[4921,"Hohenzell","O","PLZ-Adressierung","extern","Ja","Nein"]
[4922,"Geiersberg","O","PLZ-Adressierung","extern","Ja","Nein"]
[4923,"Lohnsburg","O","PLZ-Adressierung","extern","Ja","Ja"]
[4924,"Waldzell","O","PLZ-Adressierung","extern","Ja","Ja"]
[4925,"Pramet","O","PLZ-Adressierung","extern","Ja","Nein"]
[4926,"St. Marienkirchen am Hausruck","O","PLZ-Adressierung","extern","Ja","Nein"]
[4931,"Mettmach","O","PLZ-Adressierung","extern","Ja","Ja"]
[4932,"Kirchheim im Innkreis","O","PLZ-Adressierung","extern","Ja","Nein"]
[4933,"Wildenau","O","PLZ-Adressierung","extern","Ja","Nein"]
[4941,"Mehrnbach","O","PLZ-Adressierung","extern","Ja","Nein"]
[4942,"Gurten","O","PLZ-Adressierung","extern","Ja","Nein"]
[4943,"Geinberg","O","PLZ-Adressierung","extern","Ja","Ja"]
[4950,"Altheim","O","PLZ-Adressierung","extern","Ja","Ja"]
[4951,"Polling im Innkreis","O","PLZ-Adressierung","extern","Ja","Nein"]
[4952,"Weng im Innkreis","O","PLZ-Adressierung","extern","Ja","Nein"]
[4961,"Mühlheim am Inn","O","PLZ-Adressierung","extern","Ja","Nein"]
[4962,"Mining","O","PLZ-Adressierung","extern","Ja","Nein"]
[4963,"St. Peter am Hart","O","PLZ-Adressierung","extern","Ja","Nein"]
[4970,"Eitzing","O","PLZ-Adressierung","extern","Ja","Nein"]
[4971,"Aurolzmünster","O","PLZ-Adressierung","extern","Ja","Ja"]
[4972,"Utzenaich","O","PLZ-Adressierung","extern","Ja","Nein"]
[4973,"St. Martin","O","PLZ-Adressierung","extern","Ja","Ja"]
[4974,"Ort im Innkreis","O","PLZ-Adressierung","extern","Ja","Nein"]
[4975,"Suben","O","PLZ-Adressierung","extern","Ja","Nein"]
[4980,"Antiesenhofen","O","PLZ-Adressierung","extern","Ja","Nein"]
[4981,"Reichersberg","O","PLZ-Adressierung","extern","Ja","Nein"]
[4982,"Obernberg am Inn","O","PLZ-Adressierung","extern","Ja","Ja"]
[4983,"St. Georgen bei Obernberg am Inn","O","PLZ-Adressierung","extern","Ja","Nein"]
[4984,"Weilbach","O","PLZ-Adressierung","extern","Ja","Nein"]
[5010,"Salzburg","Sa","PLZ-Postfach","extern","Nein","Ja"]
[5012,"Salzburg","Sa","PLZ-Postfach","extern","Nein","Ja"]
[5013,"Salzburg-Liefering","Sa","PLZ-Postfach","extern","Nein","Ja"]
[5014,"Salzburg","Sa","PLZ-Postfach","extern","Nein","Ja"]
[5015,"Salzburg","Sa","PLZ-Postfach","extern","Nein","Ja"]
[5016,"Salzburg","Sa","PLZ-Postfach","extern","Nein","Ja"]
[5017,"Salzburg","Sa","PLZ-Postfach","extern","Nein","Ja"]
[5018,"Salzburg-Europark","Sa","PLZ-Postfach","extern","Nein","Ja"]
[5020,"Salzburg","Sa","PLZ-Adressierung","extern","Ja","Ja"]
[5021,"Salzburg Postfach","Sa","PLZ-Postfach","extern","Nein","Ja"]
[5022,"Salzburg","Sa","PLZ-Postfach","extern","Nein","Ja"]
[5023,"Salzburg-Gnigl","Sa","PLZ-Adressierung","extern","Ja","Ja"]
[5024,"Salzburg","Sa","PLZ-Postfach","extern","Nein","Ja"]
[5025,"Salzburg-Parsch","Sa","PLZ-Postfach","extern","Nein","Ja"]
[5026,"Salzburg-Aigen","Sa","PLZ-Adressierung","extern","Ja","Ja"]
[5027,"Salzburg","Sa","PLZ-Postfach","extern","Nein","Ja"]
[5028,"Salzburg-Kasern","Sa","PLZ-Postfach","extern","Nein","Ja"]
[5029,"Salzburg","Sa","PLZ-Postfach","extern","Nein","Ja"]
[5033,"Salzburg","Sa","PLZ-Postfach","extern","Nein","Ja"]
[5034,"Salzburg-Morzg","Sa","PLZ-Postfach","extern","Nein","Ja"]
[5061,"Elsbethen-Glasenbach","Sa","PLZ-Adressierung","extern","Ja","Ja"]
[5071,"Wals","Sa","PLZ-Adressierung","extern","Ja","Ja"]
[5072,"Siezenheim","Sa","PLZ-Postfach","extern","Nein","Ja"]
[5073,"Wals-Himmelreich","Sa","PLZ-Postfach","extern","Nein","Ja"]
[5081,"Anif","Sa","PLZ-Adressierung","extern","Ja","Ja"]
[5082,"Grödig","Sa","PLZ-Adressierung","extern","Ja","Ja"]
[5083,"Gartenau-St. Leonhard","Sa","PLZ-Adressierung","extern","Ja","Ja"]
[5084,"Großgmain","Sa","PLZ-Adressierung","extern","Ja","Ja"]
[5089,"Niederalm","Sa","PLZ-Postfach","extern","Nein","Ja"]
[5090,"Lofer","Sa","PLZ-Adressierung","extern","Ja","Ja"]
[5091,"Unken","Sa","PLZ-Adressierung","extern","Ja","Ja"]
[5092,"St. Martin bei Lofer","Sa","PLZ-Adressierung","extern","Ja","Nein"]
[5093,"Weißbach bei Lofer","Sa","PLZ-Adressierung","extern","Ja","Nein"]
[5101,"Bergheim","Sa","PLZ-Adressierung","extern","Ja","Ja"]
[5102,"Anthering","Sa","PLZ-Adressierung","extern","Ja","Ja"]
[5110,"Oberndorf bei Salzburg","Sa","PLZ-Adressierung","extern","Ja","Ja"]
[5111,"Bürmoos","Sa","PLZ-Adressierung","extern","Ja","Ja"]
[5112,"Lamprechtshausen","Sa","PLZ-Adressierung","extern","Ja","Ja"]
[5113,"St. Georgen bei Salzburg","Sa","PLZ-Adressierung","extern","Ja","Nein"]
[5114,"Göming","Sa","PLZ-Adressierung","extern","Ja","Nein"]
[5120,"St. Pantaleon","O","PLZ-Adressierung","extern","Ja","Nein"]
[5121,"Ostermiething","O","PLZ-Adressierung","extern","Ja","Ja"]
[5122,"Ach","O","PLZ-Adressierung","extern","Ja","Ja"]
[5131,"Franking","O","PLZ-Adressierung","extern","Ja","Nein"]
[5132,"Geretsberg","O","PLZ-Adressierung","extern","Ja","Nein"]
[5133,"Gilgenberg am Weilhart","O","PLZ-Adressierung","extern","Ja","Nein"]
[5134,"Schwand im Innkreis","O","PLZ-Adressierung","extern","Ja","Nein"]
[5141,"Moosdorf","O","PLZ-Adressierung","extern","Ja","Nein"]
[5142,"Eggelsberg","O","PLZ-Adressierung","extern","Ja","Ja"]
[5143,"Feldkirchen bei Mattighofen","O","PLZ-Adressierung","extern","Ja","Nein"]
[5144,"Handenberg","O","PLZ-Adressierung","extern","Ja","Nein"]
[5145,"Neukirchen an der Enknach","O","PLZ-Adressierung","extern","Ja","Ja"]
[5151,"Nußdorf am Haunsberg","Sa","PLZ-Adressierung","extern","Ja","Nein"]
[5152,"Michaelbeuern","Sa","PLZ-Adressierung","extern","Ja","Nein"]
[5161,"Elixhausen","Sa","PLZ-Adressierung","extern","Ja","Ja"]
[5162,"Obertrum am See","Sa","PLZ-Adressierung","extern","Ja","Ja"]
[5163,"Mattsee","Sa","PLZ-Adressierung","extern","Ja","Ja"]
[5164,"Seeham","Sa","PLZ-Adressierung","extern","Ja","Nein"]
[5165,"Berndorf bei Salzburg","Sa","PLZ-Adressierung","extern","Ja","Ja"]
[5201,"Seekirchen","Sa","PLZ-Adressierung","extern","Ja","Ja"]
[5202,"Neumarkt am Wallersee","Sa","PLZ-Adressierung","extern","Ja","Ja"]
[5203,"Köstendorf","Sa","PLZ-Adressierung","extern","Ja","Nein"]
[5204,"Straßwalchen","Sa","PLZ-Adressierung","extern","Ja","Ja"]
[5205,"Schleedorf","Sa","PLZ-Adressierung","extern","Ja","Nein"]
[5211,"Friedburg","O","PLZ-Adressierung","extern","Ja","Ja"]
[5212,"Schneegattern","O","PLZ-Adressierung","extern","Ja","Nein"]
[5221,"Lochen","O","PLZ-Adressierung","extern","Ja","Ja"]
[5222,"Munderfing","O","PLZ-Adressierung","extern","Ja","Ja"]
[5223,"Pfaffstätt","O","PLZ-Adressierung","extern","Ja","Nein"]
[5224,"Auerbach","O","PLZ-Adressierung","extern","Ja","Nein"]
[5225,"Jeging","O","PLZ-Adressierung","extern","Ja","Nein"]
[5230,"Mattighofen","O","PLZ-Adressierung","extern","Ja","Ja"]
[5231,"Schalchen","O","PLZ-Adressierung","extern","Ja","Nein"]
[5232,"Kirchberg bei Mattighofen","O","PLZ-Adressierung","extern","Ja","Nein"]
[5233,"Pischelsdorf am Engelbach","O","PLZ-Adressierung","extern","Ja","Nein"]
[5241,"Maria Schmolln","O","PLZ-Adressierung","extern","Ja","Nein"]
[5242,"St. Johann am Walde","O","PLZ-Adressierung","extern","Ja","Nein"]
[5251,"Höhnhart","O","PLZ-Adressierung","extern","Ja","Ja"]
[5252,"Aspach","O","PLZ-Adressierung","extern","Ja","Ja"]
[5261,"Uttendorf","O","PLZ-Adressierung","extern","Ja","Ja"]
[5270,"Mauerkirchen","O","PLZ-Adressierung","extern","Ja","Ja"]
[5271,"Moosbach","O","PLZ-Adressierung","extern","Ja","Nein"]
[5272,"Treubach","O","PLZ-Adressierung","extern","Ja","Nein"]
[5273,"Roßbach","O","PLZ-Adressierung","extern","Ja","Nein"]
[5274,"Burgkirchen","O","PLZ-Adressierung","extern","Ja","Nein"]
[5280,"Braunau am Inn","O","PLZ-Adressierung","extern","Ja","Ja"]
[5282,"Braunau","O","PLZ-Adressierung","extern","Ja","Ja"]
[5300,"Hallwang","Sa","PLZ-Adressierung","extern","Ja","Ja"]
[5301,"Eugendorf","Sa","PLZ-Adressierung","extern","Ja","Ja"]
[5302,"Henndorf am Wallersee","Sa","PLZ-Adressierung","extern","Ja","Ja"]
[5303,"Thalgau","Sa","PLZ-Adressierung","extern","Ja","Ja"]
[5310,"Mondsee","O","PLZ-Adressierung","extern","Ja","Ja"]
[5311,"Loibichl","O","PLZ-Adressierung","extern","Ja","Nein"]
[5321,"Koppl","Sa","PLZ-Adressierung","extern","Ja","Nein"]
[5322,"Hof bei Salzburg","Sa","PLZ-Adressierung","extern","Ja","Ja"]
[5323,"Ebenau","Sa","PLZ-Adressierung","extern","Ja","Nein"]
[5324,"Faistenau","Sa","PLZ-Adressierung","extern","Ja","Ja"]
[5325,"Plainfeld","Sa","PLZ-Adressierung","extern","Ja","Nein"]
[5330,"Fuschl am See","Sa","PLZ-Adressierung","extern","Ja","Ja"]
[5340,"St. Gilgen","Sa","PLZ-Adressierung","extern","Ja","Ja"]
[5342,"Abersee","Sa","PLZ-Adressierung","extern","Ja","Nein"]
[5350,"Strobl","Sa","PLZ-Adressierung","extern","Ja","Ja"]
[5351,"Aigen-Voglhub","Sa","PLZ-Adressierung","extern","Ja","Nein"]
[5360,"St. Wolfgang im Salzkammergut","O","PLZ-Adressierung","extern","Ja","Ja"]
[5400,"Hallein","Sa","PLZ-Adressierung","extern","Ja","Ja"]
[5409,"Hallein","Sa","PLZ-Postfach","extern","Nein","Ja"]
[5411,"Oberalm","Sa","PLZ-Adressierung","extern","Ja","Ja"]
[5412,"Puch bei Hallein","Sa","PLZ-Adressierung","extern","Ja","Ja"]
[5421,"Adnet","Sa","PLZ-Adressierung","extern","Ja","Ja"]
[5422,"Heilbad Dürrnberg","Sa","PLZ-Adressierung","extern","Ja","Nein"]
[5423,"St. Koloman","Sa","PLZ-Adressierung","extern","Ja","Nein"]
[5424,"Bad Vigaun","Sa","PLZ-Adressierung","extern","Ja","Nein"]
[5431,"Kuchl","Sa","PLZ-Adressierung","extern","Ja","Ja"]
[5440,"Golling an der Salzach","Sa","PLZ-Adressierung","extern","Ja","Ja"]
[5441,"Abtenau","Sa","PLZ-Adressierung","extern","Ja","Ja"]
[5442,"Rußbach am Paß Gschütt","Sa","PLZ-Adressierung","extern","Ja","Nein"]
[5450,"Werfen","Sa","PLZ-Adressierung","extern","Ja","Ja"]
[5451,"Tenneck","Sa","PLZ-Adressierung","extern","Ja","Nein"]
[5452,"Pfarrwerfen","Sa","PLZ-Adressierung","extern","Ja","Ja"]
[5453,"Werfenweng","Sa","PLZ-Adressierung","extern","Ja","Nein"]
[5500,"Bischofshofen","Sa","PLZ-Adressierung","extern","Ja","Ja"]
[5505,"Mühlbach am Hochkönig","Sa","PLZ-Adressierung","extern","Ja","Ja"]
[5511,"Hüttau","Sa","PLZ-Adressierung","extern","Ja","Nein"]
[5521,"Niedernfritz","Sa","PLZ-Adressierung","extern","Ja","Nein"]
[5522,"St. Martin am Tennengebirge","Sa","PLZ-Adressierung","extern","Ja","Ja"]
[5523,"Lungötz","Sa","PLZ-Adressierung","extern","Ja","Nein"]
[5524,"Annaberg","Sa","PLZ-Adressierung","extern","Ja","Ja"]
[5531,"Eben im Pongau","Sa","PLZ-Adressierung","extern","Ja","Ja"]
[5532,"Filzmoos","Sa","PLZ-Adressierung","extern","Ja","Ja"]
[5541,"Altenmarkt im Pongau","Sa","PLZ-Adressierung","extern","Ja","Ja"]
[5542,"Flachau","Sa","PLZ-Adressierung","extern","Ja","Ja"]
[5550,"Radstadt","Sa","PLZ-Adressierung","extern","Ja","Ja"]
[5552,"Forstau","Sa","PLZ-Adressierung","extern","Ja","Nein"]
[5561,"Untertauern","Sa","PLZ-Adressierung","extern","Ja","Nein"]
[5562,"Obertauern","Sa","PLZ-Adressierung","extern","Ja","Ja"]
[5563,"Tweng","Sa","PLZ-Adressierung","extern","Ja","Nein"]
[5570,"Mauterndorf","Sa","PLZ-Adressierung","extern","Ja","Ja"]
[5571,"Mariapfarr","Sa","PLZ-Adressierung","extern","Ja","Ja"]
[5572,"St. Andrä im Lungau","Sa","PLZ-Adressierung","extern","Ja","Nein"]
[5573,"Weißpriach","Sa","PLZ-Adressierung","extern","Ja","Nein"]
[5580,"Tamsweg","Sa","PLZ-Adressierung","extern","Ja","Ja"]
[5581,"St. Margarethen im Lungau","Sa","PLZ-Adressierung","extern","Ja","Nein"]
[5582,"St. Michael im Lungau","Sa","PLZ-Adressierung","extern","Ja","Ja"]
[5583,"Muhr","Sa","PLZ-Adressierung","extern","Ja","Nein"]
[5584,"Zederhaus","Sa","PLZ-Adressierung","extern","Ja","Nein"]
[5585,"Unternberg","Sa","PLZ-Adressierung","extern","Ja","Nein"]
[5591,"Ramingstein","Sa","PLZ-Adressierung","extern","Ja","Nein"]
[5592,"Thomatal","Sa","PLZ-Adressierung","extern","Ja","Nein"]
[5600,"St. Johann im Pongau","Sa","PLZ-Adressierung","extern","Ja","Ja"]
[5602,"Wagrain","Sa","PLZ-Adressierung","extern","Ja","Ja"]
[5603,"Kleinarl","Sa","PLZ-Adressierung","extern","Ja","Nein"]
[5611,"Großarl","Sa","PLZ-Adressierung","extern","Ja","Ja"]
[5612,"Hüttschlag","Sa","PLZ-Adressierung","extern","Ja","Nein"]
[5620,"Schwarzach im Pongau","Sa","PLZ-Adressierung","extern","Ja","Ja"]
[5621,"St. Veit im Pongau","Sa","PLZ-Adressierung","extern","Ja","Nein"]
[5622,"Goldegg","Sa","PLZ-Adressierung","extern","Ja","Nein"]
[5623,"Schwarzach im Pongau","Sa","InteressentenPLZ","extern","Nein","Ja"]
[5630,"Bad Hofgastein","Sa","PLZ-Adressierung","extern","Ja","Ja"]
[5632,"Dorfgastein","Sa","PLZ-Adressierung","extern","Ja","Nein"]
[5640,"Bad Gastein","Sa","PLZ-Adressierung","extern","Ja","Ja"]
[5645,"Böckstein","Sa","PLZ-Adressierung","extern","Ja","Nein"]
[5651,"Lend","Sa","PLZ-Adressierung","extern","Ja","Nein"]
[5652,"Dienten am Hochkönig","Sa","PLZ-Adressierung","extern","Ja","Nein"]
[5660,"Taxenbach","Sa","PLZ-Adressierung","extern","Ja","Ja"]
[5661,"Rauris","Sa","PLZ-Adressierung","extern","Ja","Ja"]
[5662,"Gries","Sa","PLZ-Adressierung","extern","Ja","Nein"]
[5671,"Bruck an der Großglocknerstraße","Sa","PLZ-Adressierung","extern","Ja","Ja"]
[5672,"Fusch an der Glocknerstraße","Sa","PLZ-Adressierung","extern","Ja","Nein"]
[5700,"Zell am See","Sa","PLZ-Adressierung","extern","Ja","Ja"]
[5702,"Zell am See-Schüttdorf","Sa","PLZ-Postfach","extern","Nein","Ja"]
[5710,"Kaprun","Sa","PLZ-Adressierung","extern","Ja","Ja"]
[5721,"Piesendorf","Sa","PLZ-Adressierung","extern","Ja","Ja"]
[5722,"Niedernsill","Sa","PLZ-Adressierung","extern","Ja","Nein"]
[5723,"Uttendorf","Sa","PLZ-Adressierung","extern","Ja","Ja"]
[5724,"Stuhlfelden","Sa","PLZ-Adressierung","extern","Ja","Nein"]
[5730,"Mittersill","Sa","PLZ-Adressierung","extern","Ja","Ja"]
[5731,"Hollersbach im Pinzgau","Sa","PLZ-Adressierung","extern","Ja","Nein"]
[5732,"Mühlbach","Sa","PLZ-Adressierung","extern","Ja","Nein"]
[5733,"Bramberg am Wildkogel","Sa","PLZ-Adressierung","extern","Ja","Ja"]
[5741,"Neukirchen am Großvenediger","Sa","PLZ-Adressierung","extern","Ja","Ja"]
[5742,"Wald im Pinzgau","Sa","PLZ-Adressierung","extern","Ja","Ja"]
[5743,"Krimml","Sa","PLZ-Adressierung","extern","Ja","Ja"]
[5751,"Maishofen","Sa","PLZ-Adressierung","extern","Ja","Ja"]
[5752,"Viehhofen","Sa","PLZ-Adressierung","extern","Ja","Nein"]
[5753,"Saalbach","Sa","PLZ-Adressierung","extern","Ja","Ja"]
[5754,"Hinterglemm","Sa","PLZ-Adressierung","extern","Ja","Ja"]
[5760,"Saalfelden am Steinernen Meer","Sa","PLZ-Adressierung","extern","Ja","Ja"]
[5761,"Maria Alm am Steinernen Meer","Sa","PLZ-Adressierung","extern","Ja","Ja"]
[5771,"Leogang","Sa","PLZ-Adressierung","extern","Ja","Ja"]
[6010,"Innsbruck","T","PLZ-Postfach","extern","Nein","Ja"]
[6012,"Innsbruck","T","PLZ-Postfach","extern","Nein","Ja"]
[6013,"Innsbruck","T","PLZ-Postfach","extern","Nein","Ja"]
[6014,"Innsbruck","T","PLZ-Postfach","extern","Nein","Ja"]
[6020,"Innsbruck","T","PLZ-Adressierung","extern","Ja","Nein"]
[6021,"Innsbruck Postfach","T","PLZ-Postfach","extern","Nein","Ja"]
[6022,"Innsbruck","T","PLZ-Postfach","extern","Nein","Ja"]
[6023,"Innsbruck","T","PLZ-Postfach","extern","Nein","Ja"]
[6026,"Innsbruck","T","PLZ-Postfach","extern","Nein","Ja"]
[6027,"Innsbruck","T","PLZ-Postfach","extern","Nein","Ja"]
[6029,"Innsbruck","T","PLZ-Postfach","extern","Nein","Ja"]
[6033,"Innsbruck-Arzl","T","PLZ-Postfach","extern","Nein","Ja"]
[6040,"Innsbruck-Neuarzl","T","PLZ-Postfach","extern","Nein","Ja"]
[6050,"Hall in Tirol","T","PLZ-Postfach","extern","Nein","Ja"]
[6060,"Hall in Tirol","T","PLZ-Adressierung","extern","Ja","Ja"]
[6063,"Rum","T","PLZ-Adressierung","extern","Ja","Ja"]
[6064,"Rum","T","PLZ-Postfach","extern","Nein","Ja"]
[6065,"Thaur","T","PLZ-Adressierung","extern","Ja","Nein"]
[6067,"Absam","T","PLZ-Adressierung","extern","Ja","Ja"]
[6068,"Mils","T","PLZ-Adressierung","extern","Ja","Ja"]
[6069,"Gnadenwald","T","PLZ-Adressierung","extern","Ja","Nein"]
[6070,"Ampass","T","PLZ-Adressierung","extern","Ja","Nein"]
[6071,"Aldrans","T","PLZ-Adressierung","extern","Ja","Ja"]
[6072,"Lans","T","PLZ-Adressierung","extern","Ja","Nein"]
[6073,"Sistrans","T","PLZ-Adressierung","extern","Ja","Nein"]
[6074,"Rinn","T","PLZ-Adressierung","extern","Ja","Nein"]
[6075,"Tulfes","T","PLZ-Adressierung","extern","Ja","Nein"]
[6080,"Innsbruck-Igls","T","PLZ-Adressierung","extern","Ja","Ja"]
[6082,"Patsch","T","PLZ-Adressierung","extern","Ja","Nein"]
[6083,"Ellbögen","T","PLZ-Adressierung","extern","Ja","Nein"]
[6091,"Götzens","T","PLZ-Adressierung","extern","Ja","Ja"]
[6092,"Birgitz","T","PLZ-Adressierung","extern","Ja","Nein"]
[6094,"Axams","T","PLZ-Adressierung","extern","Ja","Ja"]
[6095,"Grinzens","T","PLZ-Adressierung","extern","Ja","Nein"]
[6100,"Seefeld in Tirol","T","PLZ-Adressierung","extern","Ja","Ja"]
[6103,"Reith bei Seefeld","T","PLZ-Adressierung","extern","Ja","Nein"]
[6105,"Leutasch","T","PLZ-Adressierung","extern","Ja","Nein"]
[6108,"Scharnitz","T","PLZ-Adressierung","extern","Ja","Nein"]
[6111,"Volders","T","PLZ-Adressierung","extern","Ja","Ja"]
[6112,"Wattens","T","PLZ-Adressierung","extern","Ja","Ja"]
[6113,"Wattenberg","T","PLZ-Adressierung","extern","Ja","Nein"]
[6114,"Kolsass","T","PLZ-Adressierung","extern","Ja","Ja"]
[6115,"Kolsassberg","T","PLZ-Adressierung","extern","Ja","Nein"]
[6121,"Baumkirchen","T","PLZ-Adressierung","extern","Ja","Nein"]
[6122,"Fritzens","T","PLZ-Adressierung","extern","Ja","Nein"]
[6123,"Terfens","T","PLZ-Adressierung","extern","Ja","Nein"]
[6130,"Schwaz","T","PLZ-Adressierung","extern","Ja","Ja"]
[6131,"Schwaz","T","PLZ-Postfach","extern","Nein","Ja"]
[6133,"Weerberg","T","PLZ-Adressierung","extern","Ja","Nein"]
[6134,"Vomp","T","PLZ-Adressierung","extern","Ja","Ja"]
[6135,"Stans","T","PLZ-Adressierung","extern","Ja","Ja"]
[6141,"Schönberg im Stubaital","T","PLZ-Adressierung","extern","Ja","Nein"]
[6142,"Mieders","T","PLZ-Adressierung","extern","Ja","Nein"]
[6143,"Matrei am Brenner","T","PLZ-Adressierung","extern","Ja","Ja"]
[6145,"Navis","T","PLZ-Adressierung","extern","Ja","Nein"]
[6150,"Steinach am Brenner","T","PLZ-Adressierung","extern","Ja","Ja"]
[6152,"Trins","T","PLZ-Adressierung","extern","Ja","Nein"]
[6154,"St. Jodok am Brenner","T","PLZ-Adressierung","extern","Ja","Nein"]
[6156,"Gries am Brenner","T","PLZ-Adressierung","extern","Ja","Nein"]
[6157,"Obernberg am Brenner","T","PLZ-Adressierung","extern","Ja","Nein"]
[6161,"Natters","T","PLZ-Adressierung","extern","Ja","Nein"]
[6162,"Mutters","T","PLZ-Adressierung","extern","Ja","Ja"]
[6165,"Telfes im Stubai","T","PLZ-Adressierung","extern","Ja","Nein"]
[6166,"Fulpmes","T","PLZ-Adressierung","extern","Ja","Ja"]
[6167,"Neustift im Stubaital","T","PLZ-Adressierung","extern","Ja","Ja"]
[6170,"Zirl","T","PLZ-Adressierung","extern","Ja","Ja"]
[6173,"Oberperfuss","T","PLZ-Adressierung","extern","Ja","Ja"]
[6175,"Kematen in Tirol","T","PLZ-Adressierung","extern","Ja","Ja"]
[6176,"Völs","T","PLZ-Adressierung","extern","Ja","Ja"]
[6177,"Völs","T","PLZ-Postfach","extern","Nein","Ja"]
[6178,"Unterperfuss","T","PLZ-Adressierung","extern","Ja","Nein"]
[6179,"Ranggen","T","PLZ-Adressierung","extern","Ja","Nein"]
[6181,"Sellrain","T","PLZ-Adressierung","extern","Ja","Ja"]
[6182,"Gries im Sellrain","T","PLZ-Adressierung","extern","Ja","Ja"]
[6183,"Kühtai","T","PLZ-Adressierung","extern","Ja","Nein"]
[6184,"St. Sigmund","T","PLZ-Adressierung","extern","Ja","Nein"]
[6200,"Jenbach","T","PLZ-Adressierung","extern","Ja","Ja"]
[6210,"Wiesing","T","PLZ-Adressierung","extern","Ja","Nein"]
[6212,"Maurach","T","PLZ-Adressierung","extern","Ja","Ja"]
[6213,"Pertisau","T","PLZ-Adressierung","extern","Ja","Nein"]
[6215,"Achenkirch","T","PLZ-Adressierung","extern","Ja","Ja"]
[6222,"Gallzein","T","PLZ-Adressierung","extern","Ja","Nein"]
[6230,"Brixlegg","T","PLZ-Adressierung","extern","Ja","Ja"]
[6232,"Münster","T","PLZ-Adressierung","extern","Ja","Ja"]
[6233,"Kramsach","T","PLZ-Adressierung","extern","Ja","Ja"]
[6234,"Brandenberg","T","PLZ-Adressierung","extern","Ja","Nein"]
[6235,"Reith im Alpbachtal","T","PLZ-Adressierung","extern","Ja","Nein"]
[6236,"Alpbach","T","PLZ-Adressierung","extern","Ja","Ja"]
[6240,"Rattenberg","T","PLZ-Adressierung","extern","Ja","Ja"]
[6250,"Kundl","T","PLZ-Adressierung","extern","Ja","Ja"]
[6252,"Breitenbach am Inn","T","PLZ-Adressierung","extern","Ja","Nein"]
[6260,"Bruck am Ziller","T","PLZ-Adressierung","extern","Ja","Nein"]
[6261,"Strass im Zillertal","T","PLZ-Adressierung","extern","Ja","Nein"]
[6262,"Schlitters","T","PLZ-Adressierung","extern","Ja","Ja"]
[6263,"Fügen","T","PLZ-Adressierung","extern","Ja","Ja"]
[6265,"Hart im Zillertal","T","PLZ-Adressierung","extern","Ja","Nein"]
[6271,"Uderns","T","PLZ-Adressierung","extern","Ja","Ja"]
[6272,"Kaltenbach","T","PLZ-Adressierung","extern","Ja","Ja"]
[6274,"Aschau","T","PLZ-Adressierung","extern","Ja","Ja"]
[6275,"Stumm","T","PLZ-Adressierung","extern","Ja","Nein"]
[6276,"Stummerberg","T","PLZ-Adressierung","extern","Ja","Nein"]
[6280,"Zell am Ziller","T","PLZ-Adressierung","extern","Ja","Ja"]
[6281,"Gerlos","T","PLZ-Adressierung","extern","Ja","Ja"]
[6283,"Hippach","T","PLZ-Adressierung","extern","Ja","Ja"]
[6284,"Ramsau im Zillertal","T","PLZ-Adressierung","extern","Ja","Nein"]
[6290,"Mayrhofen","T","PLZ-Adressierung","extern","Ja","Ja"]
[6292,"Finkenberg","T","PLZ-Adressierung","extern","Ja","Nein"]
[6293,"Tux","T","PLZ-Adressierung","extern","Ja","Ja"]
[6294,"Hintertux","T","PLZ-Adressierung","extern","Ja","Nein"]
[6295,"Ginzling","T","PLZ-Adressierung","extern","Ja","Nein"]
[6300,"Wörgl","T","PLZ-Adressierung","extern","Ja","Ja"]
[6302,"Wörgl","T","PLZ-Postfach","extern","Nein","Ja"]
[6305,"Itter","T","PLZ-Adressierung","extern","Ja","Nein"]
[6306,"Söll","T","PLZ-Adressierung","extern","Ja","Ja"]
[6311,"Wildschönau-Oberau","T","PLZ-Adressierung","extern","Ja","Ja"]
[6313,"Wildschönau-Auffach","T","PLZ-Adressierung","extern","Ja","Nein"]
[6314,"Wildschönau-Niederau","T","PLZ-Adressierung","extern","Ja","Nein"]
[6320,"Angerberg","T","PLZ-Adressierung","extern","Ja","Nein"]
[6322,"Kirchbichl","T","PLZ-Adressierung","extern","Ja","Ja"]
[6323,"Bad Häring","T","PLZ-Adressierung","extern","Ja","Ja"]
[6324,"Mariastein","T","PLZ-Adressierung","extern","Ja","Nein"]
[6330,"Kufstein","T","PLZ-Adressierung","extern","Ja","Ja"]
[6332,"Kufstein","T","PLZ-Postfach","extern","Nein","Ja"]
[6333,"Kufstein","T","PLZ-Postfach","extern","Nein","Ja"]
[6334,"Schwoich","T","PLZ-Adressierung","extern","Ja","Nein"]
[6335,"Thiersee","T","PLZ-Adressierung","extern","Ja","Ja"]
[6336,"Langkampfen","T","PLZ-Adressierung","extern","Ja","Nein"]
[6341,"Ebbs","T","PLZ-Adressierung","extern","Ja","Ja"]
[6342,"Niederndorf","T","PLZ-Adressierung","extern","Ja","Ja"]
[6343,"Erl","T","PLZ-Adressierung","extern","Ja","Nein"]
[6344,"Walchsee","T","PLZ-Adressierung","extern","Ja","Ja"]
[6345,"Kössen","T","PLZ-Adressierung","extern","Ja","Ja"]
[6351,"Scheffau am Wilden Kaiser","T","PLZ-Adressierung","extern","Ja","Ja"]
[6352,"Ellmau","T","PLZ-Adressierung","extern","Ja","Ja"]
[6353,"Going am Wilden Kaiser","T","PLZ-Adressierung","extern","Ja","Ja"]
[6361,"Hopfgarten","T","PLZ-Adressierung","extern","Ja","Ja"]
[6363,"Westendorf","T","PLZ-Adressierung","extern","Ja","Ja"]
[6364,"Brixen im Thale","T","PLZ-Adressierung","extern","Ja","Ja"]
[6365,"Kirchberg in Tirol","T","PLZ-Adressierung","extern","Ja","Ja"]
[6370,"Kitzbühel","T","PLZ-Adressierung","extern","Ja","Ja"]
[6372,"Oberndorf in Tirol","T","PLZ-Adressierung","extern","Ja","Ja"]
[6373,"Jochberg","T","PLZ-Adressierung","extern","Ja","Nein"]
[6380,"St. Johann in Tirol","T","PLZ-Adressierung","extern","Ja","Ja"]
[6382,"Kirchdorf in Tirol","T","PLZ-Adressierung","extern","Ja","Nein"]
[6383,"Erpfendorf","T","PLZ-Adressierung","extern","Ja","Ja"]
[6384,"Waidring","T","PLZ-Adressierung","extern","Ja","Ja"]
[6385,"Schwendt","T","PLZ-Adressierung","extern","Ja","Nein"]
[6391,"Fieberbrunn","T","PLZ-Adressierung","extern","Ja","Ja"]
[6392,"St. Jakob in Haus","T","PLZ-Adressierung","extern","Ja","Nein"]
[6393,"St. Ulrich am Pillersee","T","PLZ-Adressierung","extern","Ja","Ja"]
[6395,"Hochfilzen","T","PLZ-Adressierung","extern","Ja","Nein"]
[6401,"Inzing","T","PLZ-Adressierung","extern","Ja","Ja"]
[6402,"Hatting","T","PLZ-Adressierung","extern","Ja","Nein"]
[6403,"Flaurling","T","PLZ-Adressierung","extern","Ja","Nein"]
[6404,"Polling","T","PLZ-Adressierung","extern","Ja","Nein"]
[6405,"Pfaffenhofen","T","PLZ-Adressierung","extern","Ja","Nein"]
[6406,"Oberhofen im Inntal","T","PLZ-Adressierung","extern","Ja","Nein"]
[6408,"Pettnau","T","PLZ-Adressierung","extern","Ja","Nein"]
[6410,"Telfs","T","PLZ-Adressierung","extern","Ja","Ja"]
[6412,"Telfs-St. Georgen","T","PLZ-Postfach","extern","Nein","Ja"]
[6414,"Mieming","T","PLZ-Adressierung","extern","Ja","Ja"]
[6416,"Obsteig","T","PLZ-Adressierung","extern","Ja","Nein"]
[6421,"Rietz","T","PLZ-Adressierung","extern","Ja","Nein"]
[6422,"Stams","T","PLZ-Adressierung","extern","Ja","Ja"]
[6423,"Mötz","T","PLZ-Adressierung","extern","Ja","Nein"]
[6424,"Silz","T","PLZ-Adressierung","extern","Ja","Ja"]
[6425,"Haiming","T","PLZ-Adressierung","extern","Ja","Ja"]
[6426,"Roppen","T","PLZ-Adressierung","extern","Ja","Nein"]
[6430,"Ötztal Bahnhof","T","PLZ-Adressierung","extern","Ja","Ja"]
[6432,"Sautens","T","PLZ-Adressierung","extern","Ja","Nein"]
[6433,"Oetz","T","PLZ-Adressierung","extern","Ja","Ja"]
[6441,"Umhausen","T","PLZ-Adressierung","extern","Ja","Ja"]
[6444,"Längenfeld","T","PLZ-Adressierung","extern","Ja","Ja"]
[6450,"Sölden","T","PLZ-Adressierung","extern","Ja","Ja"]
[6452,"Hochsölden","T","PLZ-Adressierung","extern","Ja","Nein"]
[6456,"Obergurgl","T","PLZ-Adressierung","extern","Ja","Ja"]
[6458,"Vent","T","PLZ-Adressierung","extern","Ja","Nein"]
[6460,"Imst","T","PLZ-Adressierung","extern","Ja","Ja"]
[6462,"Karres","T","PLZ-Adressierung","extern","Ja","Nein"]
[6464,"Tarrenz","T","PLZ-Adressierung","extern","Ja","Nein"]
[6465,"Nassereith","T","PLZ-Adressierung","extern","Ja","Ja"]
[6471,"Arzl im Pitztal","T","PLZ-Adressierung","extern","Ja","Ja"]
[6473,"Wenns","T","PLZ-Adressierung","extern","Ja","Ja"]
[6474,"Jerzens","T","PLZ-Adressierung","extern","Ja","Nein"]
[6481,"St. Leonhard im Pitztal","T","PLZ-Adressierung","extern","Ja","Ja"]
[6491,"Schönwies","T","PLZ-Adressierung","extern","Ja","Nein"]
[6492,"Imsterberg","T","PLZ-Adressierung","extern","Ja","Nein"]
[6500,"Landeck","T","PLZ-Adressierung","extern","Ja","Ja"]
[6503,"Landeck-Öd","T","PLZ-Postfach","extern","Nein","Ja"]
[6511,"Zams","T","PLZ-Adressierung","extern","Ja","Ja"]
[6521,"Fließ","T","PLZ-Adressierung","extern","Ja","Nein"]
[6522,"Prutz","T","PLZ-Adressierung","extern","Ja","Ja"]
[6524,"Feichten im Kaunertal","T","PLZ-Adressierung","extern","Ja","Nein"]
[6527,"Kaunerberg","T","PLZ-Adressierung","extern","Ja","Nein"]
[6528,"Fendels","T","PLZ-Adressierung","extern","Ja","Nein"]
[6531,"Ried im Oberinntal","T","PLZ-Adressierung","extern","Ja","Ja"]
[6532,"Ladis","T","PLZ-Adressierung","extern","Ja","Nein"]
[6533,"Fiss","T","PLZ-Adressierung","extern","Ja","Ja"]
[6534,"Serfaus","T","PLZ-Adressierung","extern","Ja","Ja"]
[6541,"Tösens","T","PLZ-Adressierung","extern","Ja","Nein"]
[6542,"Pfunds","T","PLZ-Adressierung","extern","Ja","Ja"]
[6543,"Nauders","T","PLZ-Adressierung","extern","Ja","Ja"]
[6544,"Spiss","T","PLZ-Adressierung","extern","Ja","Nein"]
[6551,"Pians","T","PLZ-Adressierung","extern","Ja","Ja"]
[6552,"Tobadill","T","PLZ-Adressierung","extern","Ja","Nein"]
[6553,"See","T","PLZ-Adressierung","extern","Ja","Ja"]
[6555,"Kappl","T","PLZ-Adressierung","extern","Ja","Ja"]
[6561,"Ischgl","T","PLZ-Adressierung","extern","Ja","Ja"]
[6562,"Mathon","T","PLZ-Adressierung","extern","Ja","Nein"]
[6563,"Galtür","T","PLZ-Adressierung","extern","Ja","Ja"]
[6571,"Strengen","T","PLZ-Adressierung","extern","Ja","Nein"]
[6572,"Flirsch","T","PLZ-Adressierung","extern","Ja","Ja"]
[6574,"Pettneu am Arlberg","T","PLZ-Adressierung","extern","Ja","Ja"]
[6580,"St. Anton am Arlberg","T","PLZ-Adressierung","extern","Ja","Ja"]
[6591,"Grins","T","PLZ-Adressierung","extern","Ja","Nein"]
[6600,"Reutte","T","PLZ-Adressierung","extern","Ja","Ja"]
[6610,"Wängle","T","PLZ-Adressierung","extern","Ja","Nein"]
[6611,"Heiterwang","T","PLZ-Adressierung","extern","Ja","Nein"]
[6621,"Bichlbach","T","PLZ-Adressierung","extern","Ja","Ja"]
[6622,"Berwang","T","PLZ-Adressierung","extern","Ja","Nein"]
[6623,"Namlos","T","PLZ-Adressierung","extern","Ja","Nein"]
[6631,"Lermoos","T","PLZ-Adressierung","extern","Ja","Ja"]
[6632,"Ehrwald","T","PLZ-Adressierung","extern","Ja","Ja"]
[6633,"Biberwier","T","PLZ-Adressierung","extern","Ja","Nein"]
[6642,"Stanzach","T","PLZ-Adressierung","extern","Ja","Nein"]
[6644,"Elmen","T","PLZ-Adressierung","extern","Ja","Nein"]
[6645,"Vorderhornbach","T","PLZ-Adressierung","extern","Ja","Nein"]
[6646,"Hinterhornbach","T","PLZ-Adressierung","extern","Ja","Nein"]
[6647,"Pfafflar","T","PLZ-Adressierung","extern","Ja","Nein"]
[6650,"Gramais","T","PLZ-Adressierung","extern","Ja","Nein"]
[6651,"Häselgehr","T","PLZ-Adressierung","extern","Ja","Nein"]
[6652,"Elbigenalp","T","PLZ-Adressierung","extern","Ja","Ja"]
[6653,"Bach","T","PLZ-Adressierung","extern","Ja","Nein"]
[6654,"Holzgau","T","PLZ-Adressierung","extern","Ja","Nein"]
[6655,"Steeg","T","PLZ-Adressierung","extern","Ja","Nein"]
[6670,"Forchach","T","PLZ-Adressierung","extern","Ja","Nein"]
[6671,"Weißenbach am Lech","T","PLZ-Adressierung","extern","Ja","Ja"]
[6672,"Nesselwängle","T","PLZ-Adressierung","extern","Ja","Nein"]
[6673,"Grän","T","PLZ-Adressierung","extern","Ja","Nein"]
[6675,"Tannheim","T","PLZ-Adressierung","extern","Ja","Ja"]
[6677,"Schattwald","T","PLZ-Adressierung","extern","Ja","Nein"]
[6682,"Vils","T","PLZ-Adressierung","extern","Ja","Ja"]
[6691,"Jungholz","T","PLZ-Adressierung","extern","Ja","Ja"]
[6700,"Bludenz","V","PLZ-Adressierung","extern","Ja","Ja"]
[6701,"Bludenz Postfach","V","PLZ-Postfach","extern","Nein","Ja"]
[6706,"Bürs","V","PLZ-Adressierung","extern","Ja","Ja"]
[6707,"Bürserberg","V","PLZ-Adressierung","extern","Ja","Nein"]
[6708,"Brand","V","PLZ-Adressierung","extern","Ja","Nein"]
[6710,"Nenzing","V","PLZ-Adressierung","extern","Ja","Ja"]
[6712,"Thüringen","V","PLZ-Adressierung","extern","Ja","Ja"]
[6713,"Ludesch","V","PLZ-Adressierung","extern","Ja","Ja"]
[6714,"Nüziders","V","PLZ-Adressierung","extern","Ja","Ja"]
[6719,"Bludesch","V","PLZ-Adressierung","extern","Ja","Nein"]
[6721,"Thüringerberg","V","PLZ-Adressierung","extern","Ja","Nein"]
[6722,"St. Gerold","V","PLZ-Adressierung","extern","Ja","Nein"]
[6723,"Blons","V","PLZ-Adressierung","extern","Ja","Nein"]
[6731,"Sonntag","V","PLZ-Adressierung","extern","Ja","Ja"]
[6733,"Fontanella","V","PLZ-Adressierung","extern","Ja","Nein"]
[6741,"Raggal","V","PLZ-Adressierung","extern","Ja","Nein"]
[6751,"Braz","V","PLZ-Adressierung","extern","Ja","Nein"]
[6752,"Dalaas","V","PLZ-Adressierung","extern","Ja","Ja"]
[6754,"Klösterle","V","PLZ-Adressierung","extern","Ja","Nein"]
[6762,"Stuben","V","PLZ-Adressierung","extern","Ja","Nein"]
[6763,"Zürs","V","PLZ-Adressierung","extern","Ja","Nein"]
[6764,"Lech","V","PLZ-Adressierung","extern","Ja","Ja"]
[6767,"Warth","V","PLZ-Adressierung","extern","Ja","Nein"]
[6771,"St. Anton im Montafon","V","PLZ-Adressierung","extern","Ja","Nein"]
[6773,"Vandans","V","PLZ-Adressierung","extern","Ja","Ja"]
[6774,"Tschagguns","V","PLZ-Adressierung","extern","Ja","Ja"]
[6780,"Schruns","V","PLZ-Adressierung","extern","Ja","Ja"]
[6787,"Gargellen","V","PLZ-Adressierung","extern","Ja","Nein"]
[6791,"St. Gallenkirch","V","PLZ-Adressierung","extern","Ja","Ja"]
[6793,"Gaschurn","V","PLZ-Adressierung","extern","Ja","Ja"]
[6794,"Partenen","V","PLZ-Adressierung","extern","Ja","Nein"]
[6800,"Feldkirch","V","PLZ-Adressierung","extern","Ja","Ja"]
[6801,"Feldkirch Postfach","V","PLZ-Postfach","extern","Nein","Ja"]
[6803,"Feldkirch","V","PLZ-Postfach","extern","Nein","Ja"]
[6804,"Feldkirch-Altenstadt","V","PLZ-Postfach","extern","Nein","Ja"]
[6805,"Feldkirch-Gisingen","V","PLZ-Postfach","extern","Nein","Ja"]
[6806,"Feldkirch-Tosters","V","PLZ-Postfach","extern","Nein","Ja"]
[6807,"Feldkirch-Tisis","V","PLZ-Postfach","extern","Nein","Ja"]
[6811,"Göfis","V","PLZ-Adressierung","extern","Ja","Nein"]
[6812,"Meiningen","V","PLZ-Adressierung","extern","Ja","Nein"]
[6820,"Frastanz","V","PLZ-Adressierung","extern","Ja","Ja"]
[6822,"Satteins","V","PLZ-Adressierung","extern","Ja","Ja"]
[6824,"Schlins","V","PLZ-Adressierung","extern","Ja","Nein"]
[6830,"Rankweil","V","PLZ-Adressierung","extern","Ja","Ja"]
[6832,"Sulz-Röthis","V","PLZ-Adressierung","extern","Ja","Ja"]
[6833,"Klaus-Weiler","V","PLZ-Adressierung","extern","Ja","Ja"]
[6834,"Übersaxen","V","PLZ-Adressierung","extern","Ja","Nein"]
[6836,"Viktorsberg","V","PLZ-Adressierung","extern","Ja","Nein"]
[6840,"Götzis","V","PLZ-Adressierung","extern","Ja","Ja"]
[6841,"Mäder","V","PLZ-Adressierung","extern","Ja","Ja"]
[6842,"Koblach","V","PLZ-Adressierung","extern","Ja","Ja"]
[6844,"Altach","V","PLZ-Adressierung","extern","Ja","Ja"]
[6845,"Hohenems","V","PLZ-Adressierung","extern","Ja","Ja"]
[6850,"Dornbirn","V","PLZ-Adressierung","extern","Ja","Ja"]
[6851,"Dornbirn Postfach","V","PLZ-Postfach","extern","Nein","Ja"]
[6852,"Dornbirn-Oberdorf","V","PLZ-Postfach","extern","Nein","Ja"]
[6853,"Dornbirn-Hatlerdorf","V","PLZ-Postfach","extern","Nein","Ja"]
[6854,"Dornbirn-Messepark","V","PLZ-Postfach","extern","Nein","Ja"]
[6857,"Dornbirn-Haselstauden","V","PLZ-Postfach","extern","Nein","Ja"]
[6858,"Schwarzach","V","PLZ-Adressierung","extern","Ja","Ja"]
[6861,"Alberschwende","V","PLZ-Adressierung","extern","Ja","Ja"]
[6863,"Egg","V","PLZ-Adressierung","extern","Ja","Ja"]
[6866,"Andelsbuch","V","PLZ-Adressierung","extern","Ja","Nein"]
[6867,"Schwarzenberg","V","PLZ-Adressierung","extern","Ja","Nein"]
[6870,"Bezau","V","PLZ-Adressierung","extern","Ja","Ja"]
[6874,"Bizau","V","PLZ-Adressierung","extern","Ja","Nein"]
[6881,"Mellau","V","PLZ-Adressierung","extern","Ja","Ja"]
[6882,"Schnepfau","V","PLZ-Adressierung","extern","Ja","Nein"]
[6883,"Au","V","PLZ-Adressierung","extern","Ja","Ja"]
[6884,"Damüls","V","PLZ-Adressierung","extern","Ja","Nein"]
[6886,"Schoppernau","V","PLZ-Adressierung","extern","Ja","Nein"]
[6888,"Schröcken","V","PLZ-Adressierung","extern","Ja","Nein"]
[6890,"Lustenau","V","PLZ-Adressierung","extern","Ja","Ja"]
[6893,"Lustenau-Rheindorf","V","PLZ-Postfach","extern","Nein","Ja"]
[6900,"Bregenz","V","PLZ-Adressierung","extern","Ja","Ja"]
[6901,"Bregenz Postfach","V","PLZ-Postfach","extern","Nein","Ja"]
[6903,"Bregenz-Vorkloster","V","PLZ-Postfach","extern","Nein","Ja"]
[6904,"Bregenz-Schendlingen","V","PLZ-Postfach","extern","Nein","Ja"]
[6905,"Bregenz-Achsiedlung","V","PLZ-Postfach","extern","Nein","Ja"]
[6911,"Lochau","V","PLZ-Adressierung","extern","Ja","Ja"]
[6912,"Hörbranz","V","PLZ-Adressierung","extern","Ja","Ja"]
[6914,"Hohenweiler","V","PLZ-Adressierung","extern","Ja","Nein"]
[6921,"Kennelbach","V","PLZ-Adressierung","extern","Ja","Ja"]
[6922,"Wolfurt","V","PLZ-Adressierung","extern","Ja","Ja"]
[6923,"Lauterach","V","PLZ-Adressierung","extern","Ja","Ja"]
[6932,"Langen bei Bregenz","V","PLZ-Adressierung","extern","Ja","Ja"]
[6933,"Doren","V","PLZ-Adressierung","extern","Ja","Nein"]
[6934,"Sulzberg","V","PLZ-Adressierung","extern","Ja","Nein"]
[6941,"Langenegg","V","PLZ-Adressierung","extern","Ja","Nein"]
[6942,"Krumbach","V","PLZ-Adressierung","extern","Ja","Ja"]
[6943,"Riefensberg","V","PLZ-Adressierung","extern","Ja","Nein"]
[6951,"Lingenau","V","PLZ-Adressierung","extern","Ja","Nein"]
[6952,"Hittisau","V","PLZ-Adressierung","extern","Ja","Ja"]
[6960,"Wolfurt-Bahnhof","V","PLZ-Adressierung","extern","Ja","Ja"]
[6961,"Wolfurt-Bahnhof Postfach","V","PLZ-Postfach","extern","Nein","Ja"]
[6971,"Hard","V","PLZ-Adressierung","extern","Ja","Ja"]
[6972,"Fußach","V","PLZ-Adressierung","extern","Ja","Ja"]
[6973,"Höchst","V","PLZ-Adressierung","extern","Ja","Ja"]
[6974,"Gaißau","V","PLZ-Adressierung","extern","Ja","Ja"]
[6991,"Riezlern","V","PLZ-Adressierung","extern","Ja","Ja"]
[6992,"Hirschegg","V","PLZ-Adressierung","extern","Ja","Ja"]
[6993,"Mittelberg","V","PLZ-Adressierung","extern","Ja","Nein"]
[7000,"Eisenstadt","B","PLZ-Adressierung","extern","Ja","Ja"]
[7001,"Eisenstadt Postfach","B","PLZ-Postfach","extern","Nein","Ja"]
[7002,"Eisenstadt","B","PLZ-Postfach","extern","Nein","Ja"]
[7011,"Siegendorf","B","PLZ-Adressierung","extern","Ja","Nein"]
[7013,"Klingenbach","B","PLZ-Adressierung","extern","Ja","Ja"]
[7021,"Draßburg","B","PLZ-Adressierung","extern","Ja","Ja"]
[7022,"Schattendorf","B","PLZ-Adressierung","extern","Ja","Ja"]
[7023,"Zemendorf","B","PLZ-Adressierung","extern","Ja","Nein"]
[7024,"Hirm","B","PLZ-Adressierung","extern","Ja","Ja"]
[7031,"Krensdorf","B","PLZ-Adressierung","extern","Ja","Nein"]
[7032,"Sigleß","B","PLZ-Adressierung","extern","Ja","Nein"]
[7033,"Pöttsching","B","PLZ-Adressierung","extern","Ja","Ja"]
[7034,"Zillingtal","B","PLZ-Adressierung","extern","Ja","Nein"]
[7035,"Steinbrunn","B","PLZ-Adressierung","extern","Ja","Ja"]
[7041,"Wulkaprodersdorf","B","PLZ-Adressierung","extern","Ja","Ja"]
[7051,"Großhöflein","B","PLZ-Adressierung","extern","Ja","Nein"]
[7052,"Müllendorf","B","PLZ-Adressierung","extern","Ja","Nein"]
[7053,"Hornstein","B","PLZ-Adressierung","extern","Ja","Ja"]
[7061,"Trausdorf an der Wulka","B","PLZ-Adressierung","extern","Ja","Nein"]
[7062,"St. Margarethen im Burgenland","B","PLZ-Adressierung","extern","Ja","Ja"]
[7063,"Oggau","B","PLZ-Adressierung","extern","Ja","Ja"]
[7064,"Oslip","B","PLZ-Adressierung","extern","Ja","Nein"]
[7071,"Rust","B","PLZ-Adressierung","extern","Ja","Ja"]
[7072,"Mörbisch am See","B","PLZ-Adressierung","extern","Ja","Ja"]
[7073,"Rust, Burgenland","B","InteressentenPLZ","extern","Nein","Ja"]
[7081,"Schützen am Gebirge","B","PLZ-Adressierung","extern","Ja","Nein"]
[7082,"Donnerskirchen","B","PLZ-Adressierung","extern","Ja","Nein"]
[7083,"Purbach am Neusiedler See","B","PLZ-Adressierung","extern","Ja","Ja"]
[7091,"Breitenbrunn","B","PLZ-Adressierung","extern","Ja","Ja"]
[7092,"Winden am See","B","PLZ-Adressierung","extern","Ja","Nein"]
[7093,"Jois","B","PLZ-Adressierung","extern","Ja","Nein"]
[7100,"Neusiedl am See","B","PLZ-Adressierung","extern","Ja","Ja"]
[7111,"Parndorf","B","PLZ-Adressierung","extern","Ja","Ja"]
[7121,"Weiden am See","B","PLZ-Adressierung","extern","Ja","Nein"]
[7122,"Gols","B","PLZ-Adressierung","extern","Ja","Ja"]
[7123,"Mönchhof","B","PLZ-Adressierung","extern","Ja","Ja"]
[7131,"Halbturn","B","PLZ-Adressierung","extern","Ja","Ja"]
[7132,"Frauenkirchen","B","PLZ-Adressierung","extern","Ja","Ja"]
[7141,"Podersdorf am See","B","PLZ-Adressierung","extern","Ja","Ja"]
[7142,"Illmitz","B","PLZ-Adressierung","extern","Ja","Ja"]
[7143,"Apetlon","B","PLZ-Adressierung","extern","Ja","Nein"]
[7151,"Wallern im Burgenland","B","PLZ-Adressierung","extern","Ja","Ja"]
[7152,"Pamhagen","B","PLZ-Adressierung","extern","Ja","Ja"]
[7161,"St. Andrä am Zicksee","B","PLZ-Adressierung","extern","Ja","Nein"]
[7162,"Tadten","B","PLZ-Adressierung","extern","Ja","Nein"]
[7163,"Andau","B","PLZ-Adressierung","extern","Ja","Ja"]
[7201,"Neudörfl","B","PLZ-Adressierung","extern","Ja","Ja"]
[7202,"Bad Sauerbrunn","B","PLZ-Adressierung","extern","Ja","Ja"]
[7203,"Wiesen","B","PLZ-Adressierung","extern","Ja","Nein"]
[7210,"Mattersburg","B","PLZ-Adressierung","extern","Ja","Ja"]
[7212,"Forchtenstein","B","PLZ-Adressierung","extern","Ja","Nein"]
[7221,"Marz","B","PLZ-Adressierung","extern","Ja","Nein"]
[7222,"Rohrbach bei Mattersburg","B","PLZ-Adressierung","extern","Ja","Ja"]
[7223,"Sieggraben","B","PLZ-Adressierung","extern","Ja","Nein"]
[7301,"Deutschkreutz","B","PLZ-Adressierung","extern","Ja","Ja"]
[7302,"Nikitsch","B","PLZ-Adressierung","extern","Ja","Nein"]
[7304,"Großwarasdorf","B","PLZ-Adressierung","extern","Ja","Nein"]
[7311,"Neckenmarkt","B","PLZ-Adressierung","extern","Ja","Nein"]
[7312,"Horitschon","B","PLZ-Adressierung","extern","Ja","Ja"]
[7321,"Lackendorf","B","PLZ-Adressierung","extern","Ja","Ja"]
[7322,"Lackenbach","B","PLZ-Adressierung","extern","Ja","Nein"]
[7323,"Ritzing","B","PLZ-Adressierung","extern","Ja","Nein"]
[7331,"Weppersdorf","B","PLZ-Adressierung","extern","Ja","Ja"]
[7332,"Kobersdorf","B","PLZ-Adressierung","extern","Ja","Ja"]
[7341,"Markt St. Martin","B","PLZ-Adressierung","extern","Ja","Nein"]
[7342,"Kaisersdorf","B","PLZ-Adressierung","extern","Ja","Nein"]
[7343,"Neutal","B","PLZ-Adressierung","extern","Ja","Nein"]
[7344,"Stoob","B","PLZ-Adressierung","extern","Ja","Nein"]
[7350,"Oberpullendorf","B","PLZ-Adressierung","extern","Ja","Ja"]
[7361,"Lutzmannsburg","B","PLZ-Adressierung","extern","Ja","Nein"]
[7371,"Unterrabnitz","B","PLZ-Adressierung","extern","Ja","Ja"]
[7372,"Draßmarkt","B","PLZ-Adressierung","extern","Ja","Nein"]
[7400,"Oberwart","B","PLZ-Adressierung","extern","Ja","Ja"]
[7411,"Markt Allhau","B","PLZ-Adressierung","extern","Ja","Ja"]
[7412,"Wolfau","B","PLZ-Adressierung","extern","Ja","Nein"]
[7421,"Tauchen-Schaueregg","St","PLZ-Adressierung","extern","Ja","Nein"]
[7422,"Riedlingsdorf","B","PLZ-Adressierung","extern","Ja","Ja"]
[7423,"Pinkafeld","B","PLZ-Adressierung","extern","Ja","Ja"]
[7431,"Bad Tatzmannsdorf","B","PLZ-Adressierung","extern","Ja","Ja"]
[7432,"Oberschützen","B","PLZ-Adressierung","extern","Ja","Ja"]
[7433,"Mariasdorf","B","PLZ-Adressierung","extern","Ja","Nein"]
[7434,"Bernstein","B","PLZ-Adressierung","extern","Ja","Ja"]
[7435,"Unterkohlstätten","B","PLZ-Adressierung","extern","Ja","Nein"]
[7441,"Pilgersdorf","B","PLZ-Adressierung","extern","Ja","Nein"]
[7442,"Lockenhaus","B","PLZ-Adressierung","extern","Ja","Ja"]
[7443,"Rattersdorf-Liebing","B","PLZ-Adressierung","extern","Ja","Nein"]
[7444,"Mannersdorf an der Rabnitz","B","PLZ-Adressierung","extern","Ja","Nein"]
[7451,"Oberloisdorf","B","PLZ-Adressierung","extern","Ja","Nein"]
[7452,"Unterpullendorf","B","PLZ-Adressierung","extern","Ja","Nein"]
[7453,"Steinberg-Dörfl","B","PLZ-Adressierung","extern","Ja","Nein"]
[7461,"Stadtschlaining","B","PLZ-Adressierung","extern","Ja","Ja"]
[7463,"Weiden bei Rechnitz","B","PLZ-Adressierung","extern","Ja","Nein"]
[7464,"Markt Neuhodis","B","PLZ-Adressierung","extern","Ja","Nein"]
[7471,"Rechnitz","B","PLZ-Adressierung","extern","Ja","Ja"]
[7472,"Schachendorf","B","PLZ-Adressierung","extern","Ja","Nein"]
[7473,"Hannersdorf","B","PLZ-Adressierung","extern","Ja","Nein"]
[7474,"Deutsch Schützen","B","PLZ-Adressierung","extern","Ja","Nein"]
[7501,"Rotenturm an der Pinka","B","PLZ-Adressierung","extern","Ja","Ja"]
[7503,"Großpetersdorf","B","PLZ-Adressierung","extern","Ja","Ja"]
[7511,"Mischendorf","B","PLZ-Adressierung","extern","Ja","Nein"]
[7512,"Kohfidisch","B","PLZ-Adressierung","extern","Ja","Nein"]
[7521,"Eberau","B","PLZ-Adressierung","extern","Ja","Nein"]
[7522,"Strem","B","PLZ-Adressierung","extern","Ja","Nein"]
[7531,"Kemeten","B","PLZ-Adressierung","extern","Ja","Ja"]
[7532,"Litzelsdorf","B","PLZ-Adressierung","extern","Ja","Nein"]
[7533,"Ollersdorf im Burgenland","B","PLZ-Adressierung","extern","Ja","Nein"]
[7534,"Olbendorf","B","PLZ-Adressierung","extern","Ja","Nein"]
[7535,"St. Michael im Burgenland","B","PLZ-Adressierung","extern","Ja","Ja"]
[7540,"Güssing","B","PLZ-Adressierung","extern","Ja","Ja"]
[7542,"Gerersdorf bei Güssing","B","PLZ-Adressierung","extern","Ja","Nein"]
[7543,"Kukmirn","B","PLZ-Adressierung","extern","Ja","Nein"]
[7551,"Stegersbach","B","PLZ-Adressierung","extern","Ja","Ja"]
[7552,"Stinatz","B","PLZ-Adressierung","extern","Ja","Nein"]
[7561,"Heiligenkreuz im Lafnitztal","B","PLZ-Adressierung","extern","Ja","Ja"]
[7562,"Eltendorf","B","PLZ-Adressierung","extern","Ja","Nein"]
[7563,"Königsdorf","B","PLZ-Adressierung","extern","Ja","Nein"]
[7564,"Dobersdorf","B","PLZ-Adressierung","extern","Ja","Nein"]
[7571,"Rudersdorf","B","PLZ-Adressierung","extern","Ja","Ja"]
[7572,"Deutsch Kaltenbrunn","B","PLZ-Adressierung","extern","Ja","Nein"]
[8010,"Graz","St","PLZ-Adressierung","extern","Ja","Ja"]
[8011,"Graz Postfach","St","PLZ-Postfach","extern","Nein","Ja"]
[8013,"Graz","St","PLZ-Postfach","extern","Nein","Ja"]
[8015,"Graz","St","PLZ-Postfach","extern","Nein","Ja"]
[8016,"Graz","St","PLZ-Postfach","extern","Nein","Ja"]
[8017,"Graz","St","PLZ-Postfach","extern","Nein","Ja"]
[8018,"Graz","St","PLZ-Postfach","extern","Nein","Ja"]
[8019,"Graz","St","PLZ-Postfach","extern","Nein","Ja"]
[8020,"Graz","St","PLZ-Adressierung","extern","Ja","Ja"]
[8021,"Graz Postfach","St","PLZ-Postfach","extern","Nein","Ja"]
[8022,"Graz","St","PLZ-Postfach","extern","Nein","Ja"]
[8023,"Graz","St","PLZ-Postfach","extern","Nein","Ja"]
[8024,"Graz","St","PLZ-Postfach","extern","Nein","Ja"]
[8025,"Graz","St","PLZ-Postfach","extern","Nein","Ja"]
[8026,"Graz","St","PLZ-Postfach","extern","Nein","Ja"]
[8027,"Graz","St","PLZ-Postfach","extern","Nein","Ja"]
[8028,"Graz","St","PLZ-Postfach","extern","Nein","Ja"]
[8029,"Graz","St","PLZ-Postfach","extern","Nein","Ja"]
[8035,"Graz","St","PLZ-Postfach","extern","Nein","Ja"]
[8036,"Graz","St","PLZ-Adressierung","extern","Ja","Ja"]
[8041,"Graz-Liebenau","St","PLZ-Adressierung","extern","Ja","Ja"]
[8042,"Graz-St. Peter","St","PLZ-Adressierung","extern","Ja","Ja"]
[8043,"Graz-Kroisbach","St","PLZ-Adressierung","extern","Ja","Ja"]
[8044,"Graz-Mariatrost","St","PLZ-Adressierung","extern","Ja","Ja"]
[8045,"Graz-Andritz","St","PLZ-Adressierung","extern","Ja","Ja"]
[8046,"Graz-St. Veit","St","PLZ-Adressierung","extern","Ja","Nein"]
[8047,"Graz-Ragnitz","St","PLZ-Adressierung","extern","Ja","Ja"]
[8051,"Graz-Gösting","St","PLZ-Adressierung","extern","Ja","Ja"]
[8052,"Graz-Wetzelsdorf","St","PLZ-Adressierung","extern","Ja","Ja"]
[8053,"Graz-Neuhart","St","PLZ-Adressierung","extern","Ja","Ja"]
[8054,"Graz-Straßgang","St","PLZ-Adressierung","extern","Ja","Ja"]
[8055,"Graz-Puntigam","St","PLZ-Adressierung","extern","Ja","Ja"]
[8061,"St. Radegund bei Graz","St","PLZ-Adressierung","extern","Ja","Ja"]
[8062,"Kumberg","St","PLZ-Adressierung","extern","Ja","Ja"]
[8063,"Eggersdorf bei Graz","St","PLZ-Adressierung","extern","Ja","Ja"]
[8071,"Hausmannstätten","St","PLZ-Adressierung","extern","Ja","Ja"]
[8072,"Fernitz","St","PLZ-Adressierung","extern","Ja","Ja"]
[8073,"Feldkirchen bei Graz","St","PLZ-Adressierung","extern","Ja","Ja"]
[8074,"Raaba","St","PLZ-Adressierung","extern","Ja","Ja"]
[8075,"Hart bei Graz","St","PLZ-Adressierung","extern","Ja","Ja"]
[8081,"Heiligenkreuz am Waasen","St","PLZ-Adressierung","extern","Ja","Ja"]
[8082,"Kirchbach in Steiermark","St","PLZ-Adressierung","extern","Ja","Ja"]
[8083,"St. Stefan im Rosental","St","PLZ-Adressierung","extern","Ja","Ja"]
[8091,"Jagerberg","St","PLZ-Adressierung","extern","Ja","Nein"]
[8092,"Mettersdorf am Saßbach","St","PLZ-Adressierung","extern","Ja","Nein"]
[8093,"St. Peter am Ottersbach","St","PLZ-Adressierung","extern","Ja","Ja"]
[8101,"Gratkorn","St","PLZ-Adressierung","extern","Ja","Ja"]
[8102,"Semriach","St","PLZ-Adressierung","extern","Ja","Ja"]
[8103,"Rein","St","PLZ-Adressierung","extern","Ja","Nein"]
[8111,"Judendorf-Straßengel","St","PLZ-Adressierung","extern","Ja","Ja"]
[8112,"Gratwein","St","PLZ-Adressierung","extern","Ja","Ja"]
[8113,"St. Oswald bei Plankenwarth","St","PLZ-Adressierung","extern","Ja","Nein"]
[8114,"Stübing","St","PLZ-Adressierung","extern","Ja","Nein"]
[8120,"Peggau","St","PLZ-Adressierung","extern","Ja","Nein"]
[8121,"Deutschfeistritz","St","PLZ-Adressierung","extern","Ja","Ja"]
[8122,"Waldstein","St","PLZ-Adressierung","extern","Ja","Nein"]
[8124,"Übelbach","St","PLZ-Adressierung","extern","Ja","Ja"]
[8130,"Frohnleiten","St","PLZ-Adressierung","extern","Ja","Ja"]
[8131,"Mixnitz","St","PLZ-Adressierung","extern","Ja","Nein"]
[8132,"Pernegg an der Mur","St","PLZ-Adressierung","extern","Ja","Nein"]
[8141,"Unterpremstätten","St","PLZ-Adressierung","extern","Ja","Ja"]
[8142,"Wundschuh","St","PLZ-Adressierung","extern","Ja","Ja"]
[8143,"Dobl","St","PLZ-Adressierung","extern","Ja","Nein"]
[8144,"Tobelbad","St","PLZ-Adressierung","extern","Ja","Nein"]
[8151,"Hitzendorf","St","PLZ-Adressierung","extern","Ja","Ja"]
[8152,"Stallhofen","St","PLZ-Adressierung","extern","Ja","Ja"]
[8153,"Geistthal","St","PLZ-Adressierung","extern","Ja","Nein"]
[8160,"Weiz","St","PLZ-Adressierung","extern","Ja","Ja"]
[8162,"Passail","St","PLZ-Adressierung","extern","Ja","Ja"]
[8163,"Fladnitz an der Teichalm","St","PLZ-Adressierung","extern","Ja","Nein"]
[8171,"St. Kathrein am Offenegg","St","PLZ-Adressierung","extern","Ja","Nein"]
[8172,"Heilbrunn","St","PLZ-Adressierung","extern","Ja","Nein"]
[8181,"St. Ruprecht an der Raab","St","PLZ-Adressierung","extern","Ja","Ja"]
[8182,"Puch bei Weiz","St","PLZ-Adressierung","extern","Ja","Nein"]
[8183,"Floing","St","PLZ-Adressierung","extern","Ja","Nein"]
[8184,"Anger","St","PLZ-Adressierung","extern","Ja","Ja"]
[8190,"Birkfeld","St","PLZ-Adressierung","extern","Ja","Ja"]
[8191,"Koglhof","St","PLZ-Adressierung","extern","Ja","Nein"]
[8192,"Strallegg","St","PLZ-Adressierung","extern","Ja","Nein"]
[8200,"Gleisdorf","St","PLZ-Adressierung","extern","Ja","Ja"]
[8211,"Großpesendorf","St","PLZ-Adressierung","extern","Ja","Nein"]
[8212,"Pischelsdorf in der Steiermark","St","PLZ-Adressierung","extern","Ja","Ja"]
[8221,"Hirnsdorf","St","PLZ-Adressierung","extern","Ja","Nein"]
[8222,"St. Johann bei Herberstein","St","PLZ-Adressierung","extern","Ja","Nein"]
[8223,"Stubenberg am See","St","PLZ-Adressierung","extern","Ja","Ja"]
[8224,"Kaindorf bei Hartberg","St","PLZ-Adressierung","extern","Ja","Ja"]
[8225,"Pöllau bei Hartberg","St","PLZ-Adressierung","extern","Ja","Ja"]
[8230,"Hartberg","St","PLZ-Adressierung","extern","Ja","Ja"]
[8232,"Grafendorf bei Hartberg","St","PLZ-Adressierung","extern","Ja","Ja"]
[8233,"Lafnitz","St","PLZ-Adressierung","extern","Ja","Nein"]
[8234,"Rohrbach an der Lafnitz","St","PLZ-Adressierung","extern","Ja","Nein"]
[8240,"Friedberg","St","PLZ-Adressierung","extern","Ja","Ja"]
[8241,"Dechantskirchen","St","PLZ-Adressierung","extern","Ja","Ja"]
[8242,"St. Lorenzen am Wechsel","St","PLZ-Adressierung","extern","Ja","Nein"]
[8243,"Pinggau","St","PLZ-Adressierung","extern","Ja","Ja"]
[8244,"Schäffern","St","PLZ-Adressierung","extern","Ja","Nein"]
[8250,"Vorau","St","PLZ-Adressierung","extern","Ja","Ja"]
[8251,"Bruck an der Lafnitz","St","PLZ-Adressierung","extern","Ja","Nein"]
[8252,"Mönichwald","St","PLZ-Adressierung","extern","Ja","Nein"]
[8253,"Waldbach","St","PLZ-Adressierung","extern","Ja","Ja"]
[8254,"Wenigzell","St","PLZ-Adressierung","extern","Ja","Ja"]
[8255,"St. Jakob","St","PLZ-Adressierung","extern","Ja","Nein"]
[8261,"Sinabelkirchen","St","PLZ-Adressierung","extern","Ja","Ja"]
[8262,"Ilz","St","PLZ-Adressierung","extern","Ja","Ja"]
[8263,"Großwilfersdorf","St","PLZ-Adressierung","extern","Ja","Ja"]
[8264,"Hainersdorf","St","PLZ-Adressierung","extern","Ja","Nein"]
[8265,"Großsteinbach","St","PLZ-Adressierung","extern","Ja","Nein"]
[8271,"Bad Waltersdorf","St","PLZ-Adressierung","extern","Ja","Ja"]
[8272,"Sebersdorf","St","PLZ-Adressierung","extern","Ja","Nein"]
[8273,"Ebersdorf","St","PLZ-Adressierung","extern","Ja","Nein"]
[8274,"Buch","St","PLZ-Adressierung","extern","Ja","Nein"]
[8280,"Fürstenfeld","St","PLZ-Adressierung","extern","Ja","Ja"]
[8282,"Loipersdorf bei Fürstenfeld","St","PLZ-Adressierung","extern","Ja","Ja"]
[8283,"Bad Blumau","St","PLZ-Adressierung","extern","Ja","Ja"]
[8291,"Burgau","St","PLZ-Adressierung","extern","Ja","Nein"]
[8292,"Neudau","St","PLZ-Adressierung","extern","Ja","Ja"]
[8293,"Wörth an der Lafnitz","St","PLZ-Adressierung","extern","Ja","Nein"]
[8294,"Unterrohr","St","PLZ-Adressierung","extern","Ja","Nein"]
[8295,"St. Johann in der Haide","St","PLZ-Adressierung","extern","Ja","Ja"]
[8301,"Laßnitzhöhe","St","PLZ-Adressierung","extern","Ja","Ja"]
[8302,"Nestelbach bei Graz","St","PLZ-Adressierung","extern","Ja","Nein"]
[8311,"Markt Hartmannsdorf","St","PLZ-Adressierung","extern","Ja","Ja"]
[8312,"Ottendorf an der Rittschein","St","PLZ-Adressierung","extern","Ja","Nein"]
[8313,"Breitenfeld an der Rittschein","St","PLZ-Adressierung","extern","Ja","Ja"]
[8321,"St. Margarethen an der Raab","St","PLZ-Adressierung","extern","Ja","Ja"]
[8322,"Studenzen","St","PLZ-Adressierung","extern","Ja","Ja"]
[8323,"St. Marein bei Graz","St","PLZ-Adressierung","extern","Ja","Ja"]
[8324,"Kirchberg an der Raab","St","PLZ-Adressierung","extern","Ja","Nein"]
[8330,"Feldbach","St","PLZ-Adressierung","extern","Ja","Ja"]
[8332,"Edelsbach bei Feldbach","St","PLZ-Adressierung","extern","Ja","Nein"]
[8333,"Riegersburg","St","PLZ-Adressierung","extern","Ja","Nein"]
[8334,"Lödersdorf","St","PLZ-Adressierung","extern","Ja","Nein"]
[8341,"Paldau","St","PLZ-Adressierung","extern","Ja","Ja"]
[8342,"Gnas","St","PLZ-Adressierung","extern","Ja","Ja"]
[8343,"Trautmannsdorf in Oststeiermark","St","PLZ-Adressierung","extern","Ja","Nein"]
[8344,"Bad Gleichenberg","St","PLZ-Adressierung","extern","Ja","Ja"]
[8345,"Straden","St","PLZ-Adressierung","extern","Ja","Ja"]
[8350,"Fehring","St","PLZ-Adressierung","extern","Ja","Ja"]
[8352,"Unterlamm","St","PLZ-Adressierung","extern","Ja","Nein"]
[8353,"Kapfenstein","St","PLZ-Adressierung","extern","Ja","Nein"]
[8354,"St. Anna am Aigen","St","PLZ-Adressierung","extern","Ja","Ja"]
[8355,"Tieschen","St","PLZ-Adressierung","extern","Ja","Nein"]
[8361,"Hatzendorf","St","PLZ-Adressierung","extern","Ja","Nein"]
[8362,"Söchau","St","PLZ-Adressierung","extern","Ja","Nein"]
[8380,"Jennersdorf","B","PLZ-Adressierung","extern","Ja","Ja"]
[8382,"Mogersdorf","B","PLZ-Adressierung","extern","Ja","Nein"]
[8383,"St. Martin an der Raab","B","PLZ-Adressierung","extern","Ja","Nein"]
[8384,"Minihof-Liebau","B","PLZ-Adressierung","extern","Ja","Ja"]
[8385,"Neuhaus am Klausenbach","B","PLZ-Adressierung","extern","Ja","Nein"]
[8401,"Kalsdorf bei Graz","St","PLZ-Adressierung","extern","Ja","Ja"]
[8402,"Werndorf","St","PLZ-Adressierung","extern","Ja","Nein"]
[8403,"Lebring","St","PLZ-Adressierung","extern","Ja","Ja"]
[8410,"Wildon","St","PLZ-Adressierung","extern","Ja","Ja"]
[8411,"Hengsberg","St","PLZ-Adressierung","extern","Ja","Nein"]
[8412,"Allerheiligen bei Wildon","St","PLZ-Adressierung","extern","Ja","Nein"]
[8413,"St. Georgen an der Stiefing","St","PLZ-Adressierung","extern","Ja","Nein"]
[8421,"Wolfsberg im Schwarzautal","St","PLZ-Adressierung","extern","Ja","Ja"]
[8422,"St. Nikolai ob Draßling","St","PLZ-Adressierung","extern","Ja","Nein"]
[8423,"St. Veit am Vogau","St","PLZ-Adressierung","extern","Ja","Nein"]
[8424,"Gabersdorf","St","PLZ-Adressierung","extern","Ja","Nein"]
[8430,"Leibnitz","St","PLZ-Adressierung","extern","Ja","Ja"]
[8435,"Wagna","St","PLZ-Adressierung","extern","Ja","Ja"]
[8441,"Fresing","St","PLZ-Adressierung","extern","Ja","Ja"]
[8442,"Kitzeck im Sausal","St","PLZ-Adressierung","extern","Ja","Nein"]
[8443,"Gleinstätten","St","PLZ-Adressierung","extern","Ja","Ja"]
[8444,"St. Andrä im Sausal","St","PLZ-Adressierung","extern","Ja","Nein"]
[8451,"Heimschuh","St","PLZ-Adressierung","extern","Ja","Nein"]
[8452,"Großklein","St","PLZ-Adressierung","extern","Ja","Ja"]
[8453,"St. Johann im Saggautal","St","PLZ-Adressierung","extern","Ja","Nein"]
[8454,"Arnfels","St","PLZ-Adressierung","extern","Ja","Ja"]
[8455,"Oberhaag","St","PLZ-Adressierung","extern","Ja","Nein"]
[8461,"Ehrenhausen","St","PLZ-Adressierung","extern","Ja","Ja"]
[8462,"Gamlitz","St","PLZ-Adressierung","extern","Ja","Ja"]
[8463,"Leutschach","St","PLZ-Adressierung","extern","Ja","Ja"]
[8471,"Spielfeld","St","PLZ-Adressierung","extern","Ja","Ja"]
[8472,"Straß in Steiermark","St","PLZ-Adressierung","extern","Ja","Ja"]
[8473,"Weitersfeld an der Mur","St","PLZ-Adressierung","extern","Ja","Nein"]
[8480,"Mureck","St","PLZ-Adressierung","extern","Ja","Ja"]
[8481,"Weinburg am Saßbach","St","PLZ-Adressierung","extern","Ja","Nein"]
[8482,"Gosdorf","St","PLZ-Adressierung","extern","Ja","Nein"]
[8483,"Deutsch Goritz","St","PLZ-Adressierung","extern","Ja","Nein"]
[8484,"Unterpurkla","St","PLZ-Adressierung","extern","Ja","Nein"]
[8490,"Bad Radkersburg","St","PLZ-Adressierung","extern","Ja","Ja"]
[8492,"Halbenrain","St","PLZ-Adressierung","extern","Ja","Nein"]
[8493,"Klöch","St","PLZ-Adressierung","extern","Ja","Nein"]
[8501,"Lieboch","St","PLZ-Adressierung","extern","Ja","Ja"]
[8502,"Lannach","St","PLZ-Adressierung","extern","Ja","Ja"]
[8503,"St. Josef Weststeiermark","St","PLZ-Adressierung","extern","Ja","Nein"]
[8504,"Preding","St","PLZ-Adressierung","extern","Ja","Ja"]
[8505,"St. Nikolai im Sausal","St","PLZ-Adressierung","extern","Ja","Ja"]
[8510,"Stainz","St","PLZ-Adressierung","extern","Ja","Ja"]
[8511,"St. Stefan ob Stainz","St","PLZ-Adressierung","extern","Ja","Ja"]
[8521,"Wettmannstätten","St","PLZ-Adressierung","extern","Ja","Nein"]
[8522,"Groß St. Florian","St","PLZ-Adressierung","extern","Ja","Ja"]
[8523,"Frauental an der Laßnitz","St","PLZ-Adressierung","extern","Ja","Ja"]
[8524,"Bad Gams","St","PLZ-Adressierung","extern","Ja","Nein"]
[8530,"Deutschlandsberg","St","PLZ-Adressierung","extern","Ja","Ja"]
[8541,"Schwanberg","St","PLZ-Adressierung","extern","Ja","Ja"]
[8542,"St. Peter im Sulmtal","St","PLZ-Adressierung","extern","Ja","Ja"]
[8543,"St. Martin im Sulmtal","St","PLZ-Adressierung","extern","Ja","Nein"]
[8544,"Pölfing-Brunn","St","PLZ-Adressierung","extern","Ja","Nein"]
[8551,"Wies","St","PLZ-Adressierung","extern","Ja","Ja"]
[8552,"Eibiswald","St","PLZ-Adressierung","extern","Ja","Ja"]
[8553,"St. Oswald ob Eibiswald","St","PLZ-Adressierung","extern","Ja","Nein"]
[8554,"Soboth","St","PLZ-Adressierung","extern","Ja","Nein"]
[8561,"Söding","St","PLZ-Adressierung","extern","Ja","Nein"]
[8562,"Mooskirchen","St","PLZ-Adressierung","extern","Ja","Nein"]
[8563,"Ligist","St","PLZ-Adressierung","extern","Ja","Ja"]
[8564,"Krottendorf-Gaisfeld","St","PLZ-Adressierung","extern","Ja","Ja"]
[8565,"St. Johann ob Hohenburg","St","PLZ-Adressierung","extern","Ja","Nein"]
[8570,"Voitsberg","St","PLZ-Adressierung","extern","Ja","Ja"]
[8572,"Bärnbach","St","PLZ-Adressierung","extern","Ja","Ja"]
[8573,"Kainach bei Voitsberg","St","PLZ-Adressierung","extern","Ja","Nein"]
[8580,"Köflach","St","PLZ-Adressierung","extern","Ja","Ja"]
[8582,"Rosental an der Kainach","St","PLZ-Adressierung","extern","Ja","Nein"]
[8583,"Edelschrott","St","PLZ-Adressierung","extern","Ja","Ja"]
[8584,"Hirschegg","St","PLZ-Adressierung","extern","Ja","Nein"]
[8591,"Maria Lankowitz","St","PLZ-Adressierung","extern","Ja","Nein"]
[8592,"Salla","St","PLZ-Adressierung","extern","Ja","Nein"]
[8593,"Graden","St","PLZ-Adressierung","extern","Ja","Nein"]
[8600,"Bruck an der Mur","St","PLZ-Adressierung","extern","Ja","Ja"]
[8601,"Bruck an der Mur","St","PLZ-Postfach","extern","Nein","Ja"]
[8605,"Kapfenberg","St","PLZ-Adressierung","extern","Ja","Ja"]
[8607,"Kapfenberg","St","PLZ-Postfach","extern","Nein","Ja"]
[8611,"St. Katharein an der Laming","St","PLZ-Adressierung","extern","Ja","Ja"]
[8612,"Tragöß-Oberort","St","PLZ-Adressierung","extern","Ja","Nein"]
[8614,"Breitenau","St","PLZ-Adressierung","extern","Ja","Ja"]
[8616,"Gasen","St","PLZ-Adressierung","extern","Ja","Nein"]
[8621,"Thörl","St","PLZ-Adressierung","extern","Ja","Ja"]
[8622,"Etmißl","St","PLZ-Adressierung","extern","Ja","Nein"]
[8623,"Aflenz Kurort","St","PLZ-Adressierung","extern","Ja","Ja"]
[8624,"Au","St","PLZ-Adressierung","extern","Ja","Nein"]
[8625,"Turnau","St","PLZ-Adressierung","extern","Ja","Nein"]
[8630,"Mariazell","St","PLZ-Adressierung","extern","Ja","Ja"]
[8632,"Gußwerk","St","PLZ-Adressierung","extern","Ja","Nein"]
[8634,"Wegscheid","St","PLZ-Adressierung","extern","Ja","Nein"]
[8635,"Gollrad","St","PLZ-Adressierung","extern","Ja","Nein"]
[8636,"Seewiesen","St","PLZ-Adressierung","extern","Ja","Nein"]
[8641,"St. Marein im Mürztal","St","PLZ-Adressierung","extern","Ja","Ja"]
[8642,"St. Lorenzen im Mürztal","St","PLZ-Adressierung","extern","Ja","Nein"]
[8643,"Allerheiligen im Mürztal","St","PLZ-Adressierung","extern","Ja","Ja"]
[8644,"Mürzhofen","St","PLZ-Adressierung","extern","Ja","Nein"]
[8650,"Kindberg","St","PLZ-Adressierung","extern","Ja","Ja"]
[8652,"Kindberg-Aumühl","St","PLZ-Adressierung","extern","Ja","Nein"]
[8653,"Stanz im Mürztal","St","PLZ-Adressierung","extern","Ja","Nein"]
[8654,"Fischbach","St","PLZ-Adressierung","extern","Ja","Nein"]
[8661,"Wartberg im Mürztal","St","PLZ-Adressierung","extern","Ja","Ja"]
[8662,"Mitterdorf im Mürztal","St","PLZ-Adressierung","extern","Ja","Nein"]
[8663,"Dorf Veitsch","St","PLZ-Adressierung","extern","Ja","Ja"]
[8664,"Großveitsch","St","PLZ-Adressierung","extern","Ja","Nein"]
[8665,"Langenwang","St","PLZ-Adressierung","extern","Ja","Ja"]
[8670,"Krieglach","St","PLZ-Adressierung","extern","Ja","Ja"]
[8671,"Alpl","St","PLZ-Adressierung","extern","Ja","Nein"]
[8672,"St. Kathrein am Hauenstein","St","PLZ-Adressierung","extern","Ja","Nein"]
[8673,"Ratten","St","PLZ-Adressierung","extern","Ja","Ja"]
[8674,"Rettenegg","St","PLZ-Adressierung","extern","Ja","Ja"]
[8680,"Mürzzuschlag","St","PLZ-Adressierung","extern","Ja","Ja"]
[8682,"Mürzzuschlag-Hönigsberg","St","PLZ-Adressierung","extern","Ja","Nein"]
[8684,"Spital am Semmering","St","PLZ-Adressierung","extern","Ja","Nein"]
[8685,"Steinhaus am Semmering","St","PLZ-Adressierung","extern","Ja","Nein"]
[8691,"Kapellen","St","PLZ-Adressierung","extern","Ja","Nein"]
[8692,"Neuberg an der Mürz","St","PLZ-Adressierung","extern","Ja","Ja"]
[8693,"Mürzsteg","St","PLZ-Adressierung","extern","Ja","Nein"]
[8694,"Frein an der Mürz","St","PLZ-Adressierung","extern","Ja","Nein"]
[8700,"Leoben","St","PLZ-Adressierung","extern","Ja","Ja"]
[8701,"Leoben","St","PLZ-Postfach","extern","Nein","Ja"]
[8704,"Leoben","St","PLZ-Postfach","extern","Nein","Ja"]
[8707,"Leoben","St","PLZ-Postfach","extern","Nein","Ja"]
[8712,"Niklasdorf","St","PLZ-Adressierung","extern","Ja","Ja"]
[8713,"St. Stefan ob Leoben","St","PLZ-Adressierung","extern","Ja","Ja"]
[8714,"Kraubath an der Mur","St","PLZ-Adressierung","extern","Ja","Ja"]
[8715,"St. Lorenzen bei Knittelfeld","St","PLZ-Adressierung","extern","Ja","Nein"]
[8720,"Knittelfeld","St","PLZ-Adressierung","extern","Ja","Ja"]
[8724,"Spielberg","St","PLZ-Adressierung","extern","Ja","Ja"]
[8731,"Bischoffeld","St","PLZ-Adressierung","extern","Ja","Nein"]
[8732,"Seckau","St","PLZ-Adressierung","extern","Ja","Nein"]
[8733,"St. Marein bei Knittelfeld","St","PLZ-Adressierung","extern","Ja","Nein"]
[8734,"Großlobming","St","PLZ-Adressierung","extern","Ja","Nein"]
[8740,"Zeltweg","St","PLZ-Adressierung","extern","Ja","Ja"]
[8741,"Weißkirchen in Steiermark","St","PLZ-Adressierung","extern","Ja","Ja"]
[8742,"Obdach","St","PLZ-Adressierung","extern","Ja","Ja"]
[8750,"Judenburg","St","PLZ-Adressierung","extern","Ja","Ja"]
[8752,"Fohnsdorf-Arena","St","PLZ-Postfach","extern","Nein","Ja"]
[8753,"Fohnsdorf","St","PLZ-Adressierung","extern","Ja","Ja"]
[8754,"Thalheim","St","PLZ-Adressierung","extern","Ja","Nein"]
[8755,"St. Peter ob Judenburg","St","PLZ-Adressierung","extern","Ja","Nein"]
[8756,"St. Georgen ob Judenburg","St","PLZ-Adressierung","extern","Ja","Nein"]
[8761,"Pöls","St","PLZ-Adressierung","extern","Ja","Ja"]
[8762,"Oberzeiring","St","PLZ-Adressierung","extern","Ja","Ja"]
[8763,"Möderbrugg","St","PLZ-Adressierung","extern","Ja","Ja"]
[8764,"Pusterwald","St","PLZ-Adressierung","extern","Ja","Nein"]
[8765,"St. Johann am Tauern","St","PLZ-Adressierung","extern","Ja","Nein"]
[8770,"St. Michael in Obersteiermark","St","PLZ-Adressierung","extern","Ja","Ja"]
[8772,"Timmersdorf","St","PLZ-Adressierung","extern","Ja","Nein"]
[8773,"Kammern im Liesingtal","St","PLZ-Adressierung","extern","Ja","Ja"]
[8774,"Mautern in Steiermark","St","PLZ-Adressierung","extern","Ja","Nein"]
[8775,"Kalwang","St","PLZ-Adressierung","extern","Ja","Ja"]
[8781,"Wald am Schoberpaß","St","PLZ-Adressierung","extern","Ja","Nein"]
[8782,"Treglwang","St","PLZ-Adressierung","extern","Ja","Nein"]
[8783,"Gaishorn am See","St","PLZ-Adressierung","extern","Ja","Nein"]
[8784,"Trieben","St","PLZ-Adressierung","extern","Ja","Ja"]
[8785,"Hohentauern","St","PLZ-Adressierung","extern","Ja","Nein"]
[8786,"Rottenmann","St","PLZ-Adressierung","extern","Ja","Ja"]
[8790,"Eisenerz","St","PLZ-Adressierung","extern","Ja","Ja"]
[8792,"St. Peter-Freienstein","St","PLZ-Adressierung","extern","Ja","Nein"]
[8793,"Trofaiach","St","PLZ-Adressierung","extern","Ja","Ja"]
[8794,"Vordernberg","St","PLZ-Adressierung","extern","Ja","Nein"]
[8795,"Radmer","St","PLZ-Adressierung","extern","Ja","Nein"]
[8800,"Unzmarkt","St","PLZ-Adressierung","extern","Ja","Ja"]
[8811,"Scheifling","St","PLZ-Adressierung","extern","Ja","Ja"]
[8812,"Mariahof","St","PLZ-Adressierung","extern","Ja","Nein"]
[8813,"St. Lambrecht","St","PLZ-Adressierung","extern","Ja","Nein"]
[8820,"Neumarkt in Steiermark","St","PLZ-Adressierung","extern","Ja","Ja"]
[8822,"Mühlen","St","PLZ-Adressierung","extern","Ja","Nein"]
[8831,"Niederwölz","St","PLZ-Adressierung","extern","Ja","Nein"]
[8832,"Oberwölz","St","PLZ-Adressierung","extern","Ja","Ja"]
[8833,"Teufenbach","St","PLZ-Adressierung","extern","Ja","Nein"]
[8841,"Frojach","St","PLZ-Adressierung","extern","Ja","Nein"]
[8842,"Katsch an der Mur","St","PLZ-Adressierung","extern","Ja","Ja"]
[8843,"St. Peter am Kammersberg","St","PLZ-Adressierung","extern","Ja","Nein"]
[8844,"Schöder","St","PLZ-Adressierung","extern","Ja","Nein"]
[8850,"Murau","St","PLZ-Adressierung","extern","Ja","Ja"]
[8852,"Stolzalpe","St","PLZ-Adressierung","extern","Ja","Nein"]
[8853,"Ranten","St","PLZ-Adressierung","extern","Ja","Nein"]
[8854,"Krakaudorf","St","PLZ-Adressierung","extern","Ja","Nein"]
[8861,"St. Georgen ob Murau","St","PLZ-Adressierung","extern","Ja","Nein"]
[8862,"Stadl an der Mur","St","PLZ-Adressierung","extern","Ja","Ja"]
[8863,"Predlitz","St","PLZ-Adressierung","extern","Ja","Nein"]
[8864,"Turrach","St","PLZ-Adressierung","extern","Ja","Nein"]
[8900,"Selzthal","St","PLZ-Adressierung","extern","Ja","Nein"]
[8903,"Lassing","St","PLZ-Adressierung","extern","Ja","Nein"]
[8904,"Ardning","St","PLZ-Adressierung","extern","Ja","Nein"]
[8911,"Admont","St","PLZ-Adressierung","extern","Ja","Ja"]
[8912,"Johnsbach","St","PLZ-Adressierung","extern","Ja","Nein"]
[8913,"Weng","St","PLZ-Adressierung","extern","Ja","Nein"]
[8920,"Hieflau","St","PLZ-Adressierung","extern","Ja","Ja"]
[8921,"Lainbach","St","PLZ-Adressierung","extern","Ja","Nein"]
[8922,"Gams bei Hieflau","St","PLZ-Adressierung","extern","Ja","Nein"]
[8923,"Palfau","St","PLZ-Adressierung","extern","Ja","Nein"]
[8924,"Wildalpen","St","PLZ-Adressierung","extern","Ja","Nein"]
[8931,"Landl","St","PLZ-Adressierung","extern","Ja","Ja"]
[8932,"Weißenbach an der Enns","St","PLZ-Adressierung","extern","Ja","Nein"]
[8933,"St. Gallen","St","PLZ-Adressierung","extern","Ja","Ja"]
[8934,"Altenmarkt bei St. Gallen","St","PLZ-Adressierung","extern","Ja","Nein"]
[8940,"Liezen","St","PLZ-Adressierung","extern","Ja","Ja"]
[8942,"Wörschach","St","PLZ-Adressierung","extern","Ja","Nein"]
[8943,"Aigen im Ennstal","St","PLZ-Adressierung","extern","Ja","Ja"]
[8950,"Stainach","St","PLZ-Adressierung","extern","Ja","Ja"]
[8951,"Trautenfels","St","PLZ-Adressierung","extern","Ja","Nein"]
[8952,"Irdning","St","PLZ-Adressierung","extern","Ja","Ja"]
[8953,"Donnersbach","St","PLZ-Adressierung","extern","Ja","Nein"]
[8954,"St. Martin am Grimming","St","PLZ-Adressierung","extern","Ja","Nein"]
[8960,"Öblarn","St","PLZ-Adressierung","extern","Ja","Ja"]
[8961,"Stein an der Enns","St","PLZ-Adressierung","extern","Ja","Nein"]
[8962,"Gröbming","St","PLZ-Adressierung","extern","Ja","Ja"]
[8965,"Pruggern","St","PLZ-Adressierung","extern","Ja","Nein"]
[8966,"Aich-Assach","St","PLZ-Adressierung","extern","Ja","Nein"]
[8967,"Haus","St","PLZ-Adressierung","extern","Ja","Ja"]
[8970,"Schladming","St","PLZ-Adressierung","extern","Ja","Ja"]
[8971,"Rohrmoos-Untertal","St","PLZ-Adressierung","extern","Ja","Nein"]
[8972,"Ramsau","St","PLZ-Adressierung","extern","Ja","Ja"]
[8973,"Pichl","St","PLZ-Adressierung","extern","Ja","Nein"]
[8974,"Mandling","St","PLZ-Adressierung","extern","Ja","Nein"]
[8982,"Tauplitz","St","PLZ-Adressierung","extern","Ja","Nein"]
[8983,"Bad Mitterndorf","St","PLZ-Adressierung","extern","Ja","Ja"]
[8984,"Kainisch","St","PLZ-Adressierung","extern","Ja","Nein"]
[8990,"Bad Aussee","St","PLZ-Adressierung","extern","Ja","Ja"]
[8992,"Altaussee","St","PLZ-Adressierung","extern","Ja","Ja"]
[8993,"Grundlsee","St","PLZ-Adressierung","extern","Ja","Nein"]
[9010,"Klagenfurt am Wörthersee","K","PLZ-Postfach","extern","Nein","Ja"]
[9013,"Klagenfurt am Wörthersee","K","PLZ-Postfach","extern","Nein","Ja"]
[9020,"Klagenfurt am Wörthersee","K","PLZ-Adressierung","extern","Ja","Ja"]
[9021,"Klagenfurt am Wörthersee Postfach","K","PLZ-Postfach","extern","Nein","Ja"]
[9022,"Klagenfurt am Wörthersee","K","PLZ-Postfach","extern","Nein","Ja"]
[9023,"Klagenfurt am Wörthersee","K","PLZ-Postfach","extern","Nein","Ja"]
[9024,"Klagenfurt am Wörthersee","K","PLZ-Postfach","extern","Nein","Ja"]
[9025,"Klagenfurt am Wörthersee","K","PLZ-Postfach","extern","Nein","Ja"]
[9026,"Klagenfurt am Wörthersee","K","PLZ-Postfach","extern","Nein","Ja"]
[9027,"Klagenfurt am Wörthersee","K","PLZ-Postfach","extern","Nein","Ja"]
[9028,"Klagenfurt am Wörthersee","K","PLZ-Postfach","extern","Nein","Ja"]
[9029,"Klagenfurt am Wörthersee","K","PLZ-Postfach","extern","Nein","Ja"]
[9061,"Klagenfurt-Wölfnitz","K","PLZ-Adressierung","extern","Ja","Ja"]
[9062,"Moosburg","K","PLZ-Adressierung","extern","Ja","Ja"]
[9063,"Maria Saal","K","PLZ-Adressierung","extern","Ja","Ja"]
[9064,"Pischeldorf","K","PLZ-Adressierung","extern","Ja","Ja"]
[9065,"Ebenthal","K","PLZ-Adressierung","extern","Ja","Ja"]
[9071,"Köttmannsdorf","K","PLZ-Adressierung","extern","Ja","Ja"]
[9072,"Ludmannsdorf","K","PLZ-Adressierung","extern","Ja","Nein"]
[9073,"Klagenfurt-Viktring","K","PLZ-Adressierung","extern","Ja","Ja"]
[9074,"Keutschach","K","PLZ-Adressierung","extern","Ja","Ja"]
[9081,"Reifnitz","K","PLZ-Adressierung","extern","Ja","Ja"]
[9082,"Maria Wörth","K","PLZ-Adressierung","extern","Ja","Nein"]
[9100,"Völkermarkt","K","PLZ-Adressierung","extern","Ja","Ja"]
[9102,"Mittertrixen","K","PLZ-Adressierung","extern","Ja","Nein"]
[9103,"Diex","K","PLZ-Adressierung","extern","Ja","Ja"]
[9104,"Pustritz","K","PLZ-Adressierung","extern","Ja","Nein"]
[9111,"Haimburg","K","PLZ-Adressierung","extern","Ja","Nein"]
[9112,"Griffen","K","PLZ-Adressierung","extern","Ja","Ja"]
[9113,"Ruden","K","PLZ-Adressierung","extern","Ja","Ja"]
[9121,"Tainach","K","PLZ-Adressierung","extern","Ja","Ja"]
[9122,"St. Kanzian am Klopeiner See","K","PLZ-Adressierung","extern","Ja","Ja"]
[9123,"St. Primus","K","PLZ-Adressierung","extern","Ja","Nein"]
[9125,"Kühnsdorf","K","PLZ-Adressierung","extern","Ja","Ja"]
[9130,"Poggersdorf","K","PLZ-Adressierung","extern","Ja","Nein"]
[9131,"Grafenstein","K","PLZ-Adressierung","extern","Ja","Ja"]
[9132,"Gallizien","K","PLZ-Adressierung","extern","Ja","Nein"]
[9133,"Miklauzhof","K","PLZ-Adressierung","extern","Ja","Nein"]
[9135,"Bad Eisenkappel","K","PLZ-Adressierung","extern","Ja","Ja"]
[9141,"Eberndorf","K","PLZ-Adressierung","extern","Ja","Ja"]
[9142,"Globasnitz","K","PLZ-Adressierung","extern","Ja","Ja"]
[9143,"St. Michael ob Bleiburg","K","PLZ-Adressierung","extern","Ja","Nein"]
[9150,"Bleiburg","K","PLZ-Adressierung","extern","Ja","Ja"]
[9155,"Neuhaus","K","PLZ-Adressierung","extern","Ja","Nein"]
[9161,"Maria Rain","K","PLZ-Adressierung","extern","Ja","Ja"]
[9162,"Strau","K","PLZ-Adressierung","extern","Ja","Ja"]
[9163,"Unterbergen","K","PLZ-Adressierung","extern","Ja","Nein"]
[9170,"Ferlach","K","PLZ-Adressierung","extern","Ja","Ja"]
[9173,"St. Margareten im Rosental","K","PLZ-Adressierung","extern","Ja","Nein"]
[9181,"Feistritz im Rosental","K","PLZ-Adressierung","extern","Ja","Ja"]
[9182,"Maria Elend","K","PLZ-Adressierung","extern","Ja","Nein"]
[9183,"Rosenbach","K","PLZ-Adressierung","extern","Ja","Nein"]
[9184,"St. Jakob im Rosental","K","PLZ-Adressierung","extern","Ja","Ja"]
[9201,"Krumpendorf","K","PLZ-Adressierung","extern","Ja","Ja"]
[9210,"Pörtschach am Wörther See","K","PLZ-Adressierung","extern","Ja","Ja"]
[9212,"Techelsberg am Wörther See","K","PLZ-Adressierung","extern","Ja","Nein"]
[9220,"Velden am Wörther See","K","PLZ-Adressierung","extern","Ja","Ja"]
[9231,"Köstenberg","K","PLZ-Adressierung","extern","Ja","Nein"]
[9232,"Rosegg","K","PLZ-Adressierung","extern","Ja","Ja"]
[9241,"Wernberg","K","PLZ-Adressierung","extern","Ja","Ja"]
[9300,"St. Veit an der Glan","K","PLZ-Adressierung","extern","Ja","Ja"]
[9302,"St. Veit an der Glan","K","PLZ-Postfach","extern","Nein","Ja"]
[9311,"Kraig","K","PLZ-Adressierung","extern","Ja","Nein"]
[9312,"Meiselding","K","PLZ-Adressierung","extern","Ja","Nein"]
[9313,"St. Georgen am Längsee","K","PLZ-Adressierung","extern","Ja","Nein"]
[9314,"Launsdorf","K","PLZ-Adressierung","extern","Ja","Ja"]
[9321,"Kappel am Krappfeld","K","PLZ-Adressierung","extern","Ja","Nein"]
[9322,"Micheldorf","K","PLZ-Adressierung","extern","Ja","Nein"]
[9323,"Wildbad Einöd","St","PLZ-Adressierung","extern","Ja","Nein"]
[9330,"Treibach-Althofen","K","PLZ-Adressierung","extern","Ja","Ja"]
[9334,"Guttaring","K","PLZ-Adressierung","extern","Ja","Nein"]
[9335,"Lölling","K","PLZ-Adressierung","extern","Ja","Nein"]
[9341,"Straßburg","K","PLZ-Adressierung","extern","Ja","Ja"]
[9342,"Gurk","K","PLZ-Adressierung","extern","Ja","Nein"]
[9343,"Zweinitz","K","PLZ-Adressierung","extern","Ja","Nein"]
[9344,"Weitensfeld","K","PLZ-Adressierung","extern","Ja","Ja"]
[9345,"Kleinglödnitz","K","PLZ-Adressierung","extern","Ja","Nein"]
[9346,"Glödnitz","K","PLZ-Adressierung","extern","Ja","Nein"]
[9360,"Friesach","K","PLZ-Adressierung","extern","Ja","Ja"]
[9361,"St. Salvator","K","PLZ-Adressierung","extern","Ja","Nein"]
[9362,"Grades","K","PLZ-Adressierung","extern","Ja","Nein"]
[9363,"Metnitz","K","PLZ-Adressierung","extern","Ja","Ja"]
[9371,"Brückl","K","PLZ-Adressierung","extern","Ja","Ja"]
[9372,"Eberstein","K","PLZ-Adressierung","extern","Ja","Nein"]
[9373,"Klein St. Paul","K","PLZ-Adressierung","extern","Ja","Ja"]
[9374,"Wieting","K","PLZ-Adressierung","extern","Ja","Nein"]
[9375,"Hüttenberg","K","PLZ-Adressierung","extern","Ja","Ja"]
[9376,"Knappenberg","K","PLZ-Adressierung","extern","Ja","Nein"]
[9400,"Wolfsberg","K","PLZ-Adressierung","extern","Ja","Ja"]
[9402,"Wolfsberg, Kärnten","K","PLZ-Postfach","extern","Nein","Ja"]
[9411,"St. Michael","K","PLZ-Adressierung","extern","Ja","Nein"]
[9412,"St. Margarethen im Lavanttal","K","PLZ-Adressierung","extern","Ja","Nein"]
[9413,"St. Gertraud","K","PLZ-Adressierung","extern","Ja","Nein"]
[9421,"Eitweg","K","PLZ-Adressierung","extern","Ja","Ja"]
[9422,"Maria Rojach","K","PLZ-Adressierung","extern","Ja","Nein"]
[9423,"St. Georgen","K","PLZ-Adressierung","extern","Ja","Nein"]
[9431,"St. Stefan","K","PLZ-Adressierung","extern","Ja","Ja"]
[9433,"St. Andrä","K","PLZ-Adressierung","extern","Ja","Ja"]
[9441,"Twimberg","K","PLZ-Adressierung","extern","Ja","Nein"]
[9451,"Preitenegg","K","PLZ-Adressierung","extern","Ja","Nein"]
[9461,"Prebl","K","PLZ-Adressierung","extern","Ja","Nein"]
[9462,"Bad St. Leonhard im Lavanttal","K","PLZ-Adressierung","extern","Ja","Ja"]
[9463,"Reichenfels","K","PLZ-Adressierung","extern","Ja","Nein"]
[9470,"St. Paul im Lavanttal","K","PLZ-Adressierung","extern","Ja","Ja"]
[9472,"Ettendorf","K","PLZ-Adressierung","extern","Ja","Nein"]
[9473,"Lavamünd","K","PLZ-Adressierung","extern","Ja","Ja"]
[9500,"Villach","K","PLZ-Adressierung","extern","Ja","Ja"]
[9501,"Villach","K","PLZ-Postfach","extern","Nein","Ja"]
[9503,"Villach","K","PLZ-Postfach","extern","Nein","Ja"]
[9504,"Villach-Warmbad Villach","K","PLZ-Adressierung","extern","Ja","Nein"]
[9505,"Villach","K","PLZ-Postfach","extern","Nein","Ja"]
[9506,"Villach","K","PLZ-Postfach","extern","Nein","Ja"]
[9507,"Villach","K","PLZ-Postfach","extern","Nein","Ja"]
[9508,"Villach","K","PLZ-Postfach","extern","Nein","Ja"]
[9520,"Sattendorf","K","PLZ-Adressierung","extern","Ja","Nein"]
[9521,"Treffen","K","PLZ-Adressierung","extern","Ja","Ja"]
[9523,"Villach-Landskron","K","PLZ-Adressierung","extern","Ja","Ja"]
[9524,"Villach-St. Magdalen","K","PLZ-Adressierung","extern","Ja","Ja"]
[9530,"Bad Bleiberg","K","PLZ-Adressierung","extern","Ja","Ja"]
[9531,"Kreuth","K","PLZ-Adressierung","extern","Ja","Nein"]
[9535,"Schiefling","K","PLZ-Adressierung","extern","Ja","Ja"]
[9536,"St. Egyden","K","PLZ-Adressierung","extern","Ja","Nein"]
[9541,"Einöde","K","PLZ-Adressierung","extern","Ja","Nein"]
[9542,"Afritz","K","PLZ-Adressierung","extern","Ja","Ja"]
[9543,"Arriach","K","PLZ-Adressierung","extern","Ja","Nein"]
[9544,"Feld am See","K","PLZ-Adressierung","extern","Ja","Nein"]
[9545,"Radenthein","K","PLZ-Adressierung","extern","Ja","Ja"]
[9546,"Bad Kleinkirchheim","K","PLZ-Adressierung","extern","Ja","Ja"]
[9551,"Bodensdorf","K","PLZ-Adressierung","extern","Ja","Ja"]
[9552,"Steindorf am Ossiacher See","K","PLZ-Adressierung","extern","Ja","Nein"]
[9554,"St. Urban","K","PLZ-Adressierung","extern","Ja","Nein"]
[9555,"Glanegg","K","PLZ-Adressierung","extern","Ja","Ja"]
[9556,"Liebenfels","K","PLZ-Adressierung","extern","Ja","Ja"]
[9560,"Feldkirchen in Kärnten","K","PLZ-Adressierung","extern","Ja","Ja"]
[9562,"Himmelberg","K","PLZ-Adressierung","extern","Ja","Nein"]
[9563,"Gnesau","K","PLZ-Adressierung","extern","Ja","Nein"]
[9564,"Patergassen","K","PLZ-Adressierung","extern","Ja","Ja"]
[9565,"Ebene Reichenau","K","PLZ-Adressierung","extern","Ja","Nein"]
[9570,"Ossiach","K","PLZ-Adressierung","extern","Ja","Nein"]
[9571,"Sirnitz","K","PLZ-Adressierung","extern","Ja","Ja"]
[9572,"Deutsch Griffen","K","PLZ-Adressierung","extern","Ja","Nein"]
[9580,"Villach-Drobollach am Faaker See","K","PLZ-Adressierung","extern","Ja","Ja"]
[9581,"Ledenitzen","K","PLZ-Adressierung","extern","Ja","Ja"]
[9582,"Latschach","K","PLZ-Adressierung","extern","Ja","Nein"]
[9583,"Faak am See","K","PLZ-Adressierung","extern","Ja","Nein"]
[9584,"Finkenstein","K","PLZ-Adressierung","extern","Ja","Nein"]
[9585,"Gödersdorf","K","PLZ-Adressierung","extern","Ja","Nein"]
[9586,"Fürnitz","K","PLZ-Adressierung","extern","Ja","Ja"]
[9587,"Riegersdorf","K","PLZ-Adressierung","extern","Ja","Ja"]
[9601,"Arnoldstein","K","PLZ-Adressierung","extern","Ja","Ja"]
[9602,"Thörl-Maglern","K","PLZ-Adressierung","extern","Ja","Ja"]
[9611,"Nötsch","K","PLZ-Adressierung","extern","Ja","Ja"]
[9612,"St. Georgen im Gailtal","K","PLZ-Adressierung","extern","Ja","Nein"]
[9613,"Feistritz an der Gail","K","PLZ-Adressierung","extern","Ja","Nein"]
[9614,"Vorderberg","K","PLZ-Adressierung","extern","Ja","Nein"]
[9615,"Görtschach","K","PLZ-Adressierung","extern","Ja","Nein"]
[9620,"Hermagor","K","PLZ-Adressierung","extern","Ja","Ja"]
[9622,"Weißbriach","K","PLZ-Adressierung","extern","Ja","Nein"]
[9623,"St. Stefan an der Gail","K","PLZ-Adressierung","extern","Ja","Ja"]
[9624,"Egg","K","PLZ-Adressierung","extern","Ja","Nein"]
[9631,"Jenig","K","PLZ-Adressierung","extern","Ja","Nein"]
[9632,"Kirchbach","K","PLZ-Adressierung","extern","Ja","Ja"]
[9633,"Reisach","K","PLZ-Adressierung","extern","Ja","Nein"]
[9634,"Gundersheim","K","PLZ-Adressierung","extern","Ja","Nein"]
[9635,"Dellach","K","PLZ-Adressierung","extern","Ja","Nein"]
[9640,"Kötschach-Mauthen","K","PLZ-Adressierung","extern","Ja","Ja"]
[9651,"St. Jakob im Lesachtal","K","PLZ-Adressierung","extern","Ja","Nein"]
[9652,"Birnbaum","K","PLZ-Adressierung","extern","Ja","Nein"]
[9653,"Liesing","K","PLZ-Adressierung","extern","Ja","Nein"]
[9654,"St. Lorenzen im Lesachtal","K","PLZ-Adressierung","extern","Ja","Ja"]
[9655,"Maria Luggau","K","PLZ-Adressierung","extern","Ja","Nein"]
[9701,"Rothenthurn","K","PLZ-Adressierung","extern","Ja","Nein"]
[9702,"Ferndorf","K","PLZ-Adressierung","extern","Ja","Ja"]
[9710,"Feistritz an der Drau","K","PLZ-Adressierung","extern","Ja","Ja"]
[9711,"Paternion","K","PLZ-Adressierung","extern","Ja","Nein"]
[9712,"Fresach","K","PLZ-Adressierung","extern","Ja","Nein"]
[9713,"Zlan","K","PLZ-Adressierung","extern","Ja","Ja"]
[9714,"Stockenboi","K","PLZ-Adressierung","extern","Ja","Nein"]
[9721,"Weißenstein","K","PLZ-Adressierung","extern","Ja","Ja"]
[9722,"Gummern","K","PLZ-Adressierung","extern","Ja","Nein"]
[9751,"Sachsenburg","K","PLZ-Adressierung","extern","Ja","Nein"]
[9753,"Lind im Drautal","K","PLZ-Adressierung","extern","Ja","Nein"]
[9754,"Steinfeld","K","PLZ-Adressierung","extern","Ja","Ja"]
[9761,"Greifenburg","K","PLZ-Adressierung","extern","Ja","Ja"]
[9762,"Weißensee","K","PLZ-Adressierung","extern","Ja","Ja"]
[9771,"Berg im Drautal","K","PLZ-Adressierung","extern","Ja","Nein"]
[9772,"Dellach","K","PLZ-Adressierung","extern","Ja","Ja"]
[9773,"Irschen","K","PLZ-Adressierung","extern","Ja","Nein"]
[9781,"Oberdrauburg","K","PLZ-Adressierung","extern","Ja","Ja"]
[9782,"Nikolsdorf","T","PLZ-Adressierung","extern","Ja","Nein"]
[9800,"Spittal an der Drau","K","PLZ-Adressierung","extern","Ja","Ja"]
[9802,"Spittal an der Drau","K","PLZ-Postfach","extern","Nein","Ja"]
[9803,"Spittal an der Drau","K","PLZ-Postfach","extern","Nein","Ja"]
[9805,"Baldramsdorf","K","PLZ-Adressierung","extern","Ja","Nein"]
[9811,"Lendorf","K","PLZ-Adressierung","extern","Ja","Nein"]
[9812,"Pusarnitz","K","PLZ-Adressierung","extern","Ja","Nein"]
[9813,"Möllbrücke","K","PLZ-Adressierung","extern","Ja","Ja"]
[9814,"Mühldorf","K","PLZ-Adressierung","extern","Ja","Nein"]
[9815,"Kolbnitz","K","PLZ-Adressierung","extern","Ja","Ja"]
[9816,"Penk","K","PLZ-Adressierung","extern","Ja","Nein"]
[9821,"Obervellach","K","PLZ-Adressierung","extern","Ja","Ja"]
[9822,"Mallnitz","K","PLZ-Adressierung","extern","Ja","Nein"]
[9831,"Flattach","K","PLZ-Adressierung","extern","Ja","Nein"]
[9832,"Stall","K","PLZ-Adressierung","extern","Ja","Ja"]
[9833,"Rangersdorf","K","PLZ-Adressierung","extern","Ja","Nein"]
[9841,"Winklern","K","PLZ-Adressierung","extern","Ja","Ja"]
[9842,"Mörtschach","K","PLZ-Adressierung","extern","Ja","Nein"]
[9843,"Großkirchheim","K","PLZ-Adressierung","extern","Ja","Ja"]
[9844,"Heiligenblut","K","PLZ-Adressierung","extern","Ja","Nein"]
[9851,"Lieserbrücke","K","PLZ-Adressierung","extern","Ja","Nein"]
[9852,"Trebesing","K","PLZ-Adressierung","extern","Ja","Nein"]
[9853,"Gmünd","K","PLZ-Adressierung","extern","Ja","Ja"]
[9854,"Malta","K","PLZ-Adressierung","extern","Ja","Nein"]
[9861,"Eisentratten","K","PLZ-Adressierung","extern","Ja","Nein"]
[9862,"Kremsbrücke","K","PLZ-Adressierung","extern","Ja","Nein"]
[9863,"Rennweg","K","PLZ-Adressierung","extern","Ja","Ja"]
[9871,"Seeboden","K","PLZ-Adressierung","extern","Ja","Ja"]
[9872,"Millstatt","K","PLZ-Adressierung","extern","Ja","Ja"]
[9873,"Döbriach","K","PLZ-Adressierung","extern","Ja","Nein"]
[9900,"Lienz","T","PLZ-Adressierung","extern","Ja","Ja"]
[9904,"Thurn","T","PLZ-Adressierung","extern","Ja","Nein"]
[9911,"Assling","T","PLZ-Adressierung","extern","Ja","Ja"]
[9912,"Anras","T","PLZ-Adressierung","extern","Ja","Nein"]
[9913,"Abfaltersbach","T","PLZ-Adressierung","extern","Ja","Ja"]
[9920,"Sillian","T","PLZ-Adressierung","extern","Ja","Ja"]
[9931,"Außervillgraten","T","PLZ-Adressierung","extern","Ja","Nein"]
[9932,"Innervillgraten","T","PLZ-Adressierung","extern","Ja","Ja"]
[9941,"Kartitsch","T","PLZ-Adressierung","extern","Ja","Ja"]
[9942,"Obertilliach","T","PLZ-Adressierung","extern","Ja","Nein"]
[9943,"Untertilliach","T","PLZ-Adressierung","extern","Ja","Nein"]
[9951,"Ainet","T","PLZ-Adressierung","extern","Ja","Ja"]
[9953,"Huben","T","PLZ-Historisch","intern","Nein","Nein"]
[9954,"Schlaiten","T","PLZ-Adressierung","extern","Ja","Nein"]
[9961,"Hopfgarten in Defereggen","T","PLZ-Adressierung","extern","Ja","Nein"]
[9962,"St. Veit in Defereggen","T","PLZ-Adressierung","extern","Ja","Nein"]
[9963,"St. Jakob in Defereggen","T","PLZ-Adressierung","extern","Ja","Ja"]
[9971,"Matrei in Osttirol","T","PLZ-Adressierung","extern","Ja","Ja"]
[9972,"Virgen","T","PLZ-Adressierung","extern","Ja","Nein"]
[9974,"Prägraten","T","PLZ-Adressierung","extern","Ja","Nein"]
[9981,"Kals","T","PLZ-Adressierung","extern","Ja","Ja"]
[9990,"Nußdorf-Debant","T","PLZ-Adressierung","extern","Ja","Ja"]
[9991,"Dölsach","T","PLZ-Adressierung","extern","Ja","Nein"]

{"sheet":"Strompreis","index":9,"n_rows":126,"n_cols":87,"rows_kept":126,"cut":false,"hidden":true,"merged":[[0,4,0,20]]}
["Strompreisentwicklung am 17.03.09 ",null,null,null,"http://www.e-control.at/portal/page/portal/ECONTROL_HOME/STROM/STROMPREISE/ENDVERBRAUCHERPREISE"]
[]
[null,null,null,null,null,null,null,null,null,null,null,null,null,null,null,null,"Ökostrompreisentwicklung ( für Erzeuger) gemäß energie-Control vom 17.03.09"]
[]
[]
[]
[]
[]
[]
[]
[]
[]
[]
[]
[]
[]
[]
[]
[]
[]
[]
[]
[]
[]
[]
[]
[]
[]
[]
[]
[]
[]
[]
[]
["Abgerufen am 17.03.09 von http://www.oekostrom.at/default.asp?id=60837&tt=OEKOAG_R8&hl=3"]
["Der oekostrom®-Preis beträgt brutto 21,5 ct/kWh mit Preisgarantie bis 31.12.2010 und ist österreichweit einheitlich."]
["Für geschaltete Leistungen – Wärmepumpen, Warmwasserboiler, Nachtstrom – bieten wir unseren günstigen Tarif oekostrom®-click zu brutto 15,5, ct/kWh mit Preisgarantie bis 31.12.2010"]
[]
[null,"Jan. 02","2002-02-01","Mar.02","2002-04-01","May 02","2002-06-01","2002-07-01","2002-08-01","2002-09-01","Oct.02","2002-11-01","Dec.02","Jan. 03","2003-02-01","Mar.03","2003-04-01","May 03","2003-06-01","2003-07-01","2003-08-01","2003-09-01","Oct.03","2003-11-01","Dec.03","Jan. 04","2004-02-01","Mar.04","2004-04-01","May 04","2004-06-01","2004-07-01","2004-08-01","2004-09-01","Oct.04","2004-11-01","Dec. 04","Jan. 05","2005-02-01","Mar. 05","2005-04-01","May 05","June 05","July 05","2005-08-01","2005-09-01","Oct. 05","2005-11-01","Dec. 05","Jan 06","2006-02-01","Mar. 06","2006-04-01","May 06","2006-06-01","2006-07-01","2006-08-01","2006-09-01","Oct. 06","2006-11-01","Dec. 06","Jan. 07","2007-02-01","Mar. 07","2007-04-01","May  07","June 07","July 07","2007-08-01","2007-09-01","Oct. 07","2007-11-01","2007-12-01","Jan. 08","2008-02-01","March 08","2008-04-01","2008-05-01","2008-06-01","2008-07-01","2008-08-01","2008-09-01","2008-10-01","2008-11-01","2008-12-01","Jan. 09","2009-02-01"]
[null,"2002-01-01","2002-02-01","2002-03-01","2002-04-01","2002-05-01","2002-06-01","2002-07-01","2002-08-01","2002-09-01","2002-10-01","2002-11-01","2002-12-01","2003-01-01","2003-02-01","2003-03-01","2003-04-01","2003-05-01","2003-06-01","2003-07-01","2003-08-01","2003-09-01","2003-10-01","2003-11-01","2003-12-01","2004-01-01","2004-02-01","2004-03-01","2004-04-01","2004-05-01","2004-06-01","2004-07-01","2004-08-01","2004-09-01","2004-10-01","2004-11-01","2004-12-01","2005-01-01","2005-02-01","2005-03-01","2005-04-01","2005-05-01","2005-06-01","2005-07-01","2005-08-01","2005-09-01","2005-10-01","2005-11-01","2005-12-01","2006-01-01","2006-02-01","2006-03-01","2006-04-01","2006-05-01","2006-06-01","2006-07-01","2006-08-01","2006-09-01","2006-10-01","2006-11-01","2006-12-01","Jan 07","2007-02-01","2007-03-01","2007-04-01","2007-05-01","2007-06-01","2007-07-01","2007-08-01","2007-09-01","Oct. 07","2007-11-01","2007-12-01","Jan. 08","2008-02-01","2008-03-01","2008-04-01","2008-05-01","2008-06-01","2008-07-01","2008-08-01","2008-09-01","2008-10-01","2008-11-01","Dec. 08","Jan. 09","2009-02-01"]
["Stromnetz Steiermark GmbH",16.241714285714288,16.241714285714288,16.241714285714288,16.242171428571428,16.242171428571428,16.24182857142857,16.24182857142857,16.24182857142857,16.24182857142857,16.413257142857141,16.413257142857141,16.413257142857141,16.570971428571426,16.515085714285714,16.515085714285714,16.515085714285714,16.391657142857145,16.391657142857145,16.391657142857145,16.391657142857145,16.391657142857145,16.391657142857145,16.391657142857145,16.391657142857145,16.385828571428572,16.385828571428572,16.385828571428572,16.505485714285715,16.505485714285715,16.505485714285715,16.505485714285715,16.505485714285715,16.50582857142857,16.50582857142857,16.50582857142857,16.50582857142857,16.50582857142857,16.50582857142857,16.521257142857145,16.521257142857145,16.521257142857145,15.2508571428571,15.627428571428572,15.627428571428572,15.627428571428572,15.627428571428572,15.627428571428601,15.627428571428601,15.293428571428571,15.807771428571426,15.807771428571426,15.807771428571426,15.807771428571426,15.807771428571426,15.783428571428571,15.783428571428571,15.783428571428571,15.783428571428599,15.783428571428599,15.783428571428701,16.995999999999999,16.995999999999999,16.995999999999999,16.995999999999999,16.995999999999999,16.995999999999999,17,17,17,17,17,16.55,16.940000000000001,16.940000000000001,16.940000000000001,16.940000000000001,16.940000000000001,17.66,17.66,17.66,17.66,17.66,17.559999999999999,17.559999999999999,17.149999999999999,16.420000000000002]
["Energie AG",16.277142857142859,16.277142857142859,16.381142857142859,16.381028571428573,15.712800000000003,15.712800000000003,15.712800000000003,15.712800000000003,15.712800000000003,15.712800000000003,15.712800000000003,15.712800000000003,16.087542857142857,16.029600000000002,16.029600000000002,16.029600000000002,16.029600000000002,16.029600000000002,16.029600000000002,16.029600000000002,16.029600000000002,16.029600000000002,15.526285714285713,15.526285714285713,15.852000000000002,15.852000000000002,15.852000000000002,15.971657142857143,15.971657142857143,15.971657142857143,15.971657142857143,15.971657142857143,15.972,15.972,15.972,15.972,15.972,15.972,15.98742857142857,15.98742857142857,15.987428571428573,15.0394285714285,15.415885714285716,15.415885714285716,15.415885714285716,15.415885714285716,15.4158857142857,15.4158857142857,15.225714285714284,15.739885714285712,15.739885714285712,15.739885714285712,15.739885714285712,15.739885714285712,15.696,15.696,15.696,15.696,15.696,15.696,16.68542857142857,16.68542857142857,16.68542857142857,16.68542857142857,16.68542857142857,16.68542857142857,16.690000000000001,16.690000000000001,16.690000000000001,16.690000000000001,16.690000000000001,16.239999999999998,16.61,16.61,16.61,16.61,16.61,17.329999999999998,17.329999999999998,17.329999999999998,17.329999999999998,17.329999999999998,17.23,17.23,17.149999999999999,16.45]
["Salzburg AG",15.751714285714284,15.751714285714284,15.741142857142858,15.741257142857142,15.741257142857142,15.521485714285717,15.521485714285717,15.521485714285717,15.418285714285714,15.418285714285714,15.418285714285714,15.418285714285714,15.285257142857141,15.285257142857141,15.567428571428572,15.79337142857143,15.79337142857143,15.79337142857143,15.79337142857143,15.79337142857143,15.79337142857143,15.79337142857143,15.35417142857143,15.35417142857143,15.679885714285716,15.679885714285716,15.679885714285716,15.799542857142859,15.799542857142859,15.799542857142859,15.799542857142859,15.799542857142859,15.799885714285713,15.799885714285713,15.799885714285713,15.799885714285713,15.799885714285713,15.078171428571428,15.078171428571428,15.078171428571428,15.078171428571432,15.078171428571432,15.454628571428572,15.454628571428572,15.454628571428572,15.454628571428572,15.4546285714286,15.4546285714286,15.097142857142856,15.611314285714284,15.611314285714284,15.611314285714284,15.611314285714284,15.611314285714284,15.553714285714285,15.553714285714285,15.553714285714285,15.5537142857143,15.5537142857143,15.5537142857143,16.483428571428572,16.483428571428572,16.483428571428572,16.483428571428572,16.483428571428572,16.483428571428572,16.48,16.48,16.48,16.48,16.48,16.04,16.41,16.41,16.41,16.41,16.41,17.13,17.13,17.13,17.13,17.13,17.03,17.03,16.91,16.16]
["KELAG Netz",14.736857142857142,14.736857142857142,14.736857142857142,14.736685714285715,14.736685714285715,14.736685714285715,14.736685714285715,14.736685714285715,14.736685714285715,14.736685714285715,14.736685714285715,14.736685714285715,15.40217142857143,15.344228571428571,15.344228571428571,15.344228571428571,15.344228571428571,15.344228571428571,15.344228571428571,15.344228571428571,15.344228571428571,15.344228571428571,15.34937142857143,15.34937142857143,15.91954285714286,15.91954285714286,15.91954285714286,16.039200000000001,16.039200000000001,16.039200000000001,16.039200000000001,16.030285714285714,16.030628571428576,15.489942857142857,15.727885714285717,15.727885714285717,15.727885714285717,15.5214,15.215314285714287,15.256114285714288,15.256114285714288,15.256114285714288,15.125142857142857,15.125142857142857,15.125142857142857,15.125142857142857,15.125142857142899,15.125142857142899,15.003428571428572,15.517714285714286,15.517714285714286,15.517714285714286,15.517714285714286,15.517714285714286,15.476914285714287,15.476914285714287,15.476914285714287,15.476914285714299,15.476914285714299,15.476914285714299,16.722857142857141,16.722857142857141,16.722857142857141,16.722857142857141,16.722857142857141,16.722857142857141,16.72,16.72,16.72,16.72,16.72,16.28,16.739999999999998,16.739999999999998,16.739999999999998,16.739999999999998,16.739999999999998,17.46,17.46,17.46,17.46,17.46,17.350000000000001,17.350000000000001,17.46,16.7]
["BEWAG",17.002285714285716,17.002285714285716,17.002285714285716,15.988114285714287,15.988114285714287,15.988114285714287,15.988114285714287,16.333714285714283,16.333714285714283,16.333714285714283,16.333714285714283,16.333714285714283,16.576457142857144,16.518514285714286,16.518514285714286,16.518514285714286,16.518514285714286,16.518514285714286,16.518514285714286,16.518514285714286,16.518514285714286,16.518514285714286,15.919885714285716,15.919885714285716,16.434857142857144,16.434857142857144,16.434857142857144,16.554514285714287,16.554514285714287,16.554514285714287,16.554514285714287,16.554514285714287,16.554857142857141,16.554857142857141,16.554857142857141,16.554857142857141,16.554857142857141,14.692457142857142,14.692457142857142,14.692457142857142,14.692457142857142,14.692457142857142,15.068914285714287,15.068914285714287,15.068914285714287,15.068914285714287,15.0689142857143,15.0689142857143,14.731999999999999,15.246514285714284,15.246514285714284,15.246514285714284,15.246514285714284,15.246514285714284,15.135771428571427,15.135771428571427,15.135771428571427,15.135771428571401,15.135771428571401,15.135771428571299,16.192571428571426,16.192571428571426,16.192571428571426,16.192571428571426,16.192571428571426,16.192571428571426,16.190000000000001,16.190000000000001,16.190000000000001,16.190000000000001,16.190000000000001,15.75,16.14,16.14,16.14,16.14,16.14,16.86,16.86,16.86,16.86,16.86,16.86,16.940000000000001,16.850000000000001,16.850000000000001]
["Linz Strom",15.44,15.543714285714286,15.543714285714286,15.54377142857143,14.705142857142855,14.705142857142855,14.705142857142855,14.705142857142855,14.705142857142855,14.705142857142855,14.705142857142855,14.705142857142855,15.079885714285716,15.021942857142857,15.021942857142857,15.021942857142857,15.021942857142857,15.021942857142857,15.021942857142857,15.021942857142857,15.021942857142857,15.021942857142857,14.771314285714285,14.771314285714285,15.179314285714284,15.179314285714284,15.179314285714284,15.298971428571431,15.298971428571431,15.298971428571431,15.298971428571431,15.298971428571431,15.299314285714285,15.299314285714285,15.299314285714285,15.299314285714285,15.299314285714285,15.299314285714285,15.314742857142859,15.314742857142859,15.314742857142855,14.376571428571401,14.753142857142857,14.753142857142857,14.753142857142857,14.753142857142857,14.753142857142899,14.753142857142899,14.407999999999999,15.016114285714288,15.016114285714288,15.016114285714288,15.016114285714288,15.016114285714288,14.996571428571432,14.996571428571432,14.996571428571432,14.9965714285714,14.9965714285714,14.996571428571301,16.126000000000001,16.126000000000001,16.126000000000001,16.126000000000001,16.126000000000001,16.126000000000001,16.13,16.13,16.13,16.13,16.13,15.68,15.92,15.92,15.92,15.92,15.92,16.64,16.64,16.64,16.64,16.64,16.54,16.54,16.29,15.51]
["VKW",12.881428571428572,12.881428571428572,12.881714285714287,12.881828571428573,12.881828571428573,12.881828571428573,12.768000000000001,12.768000000000001,12.804342857142855,12.804342857142855,12.804342857142855,12.804342857142855,13.214057142857142,13.104685714285713,13.104685714285713,13.104685714285713,13.104685714285713,13.104685714285713,13.104685714285713,13.104685714285713,13.104685714285713,13.104685714285713,13.120114285714285,13.120114285714285,13.74,13.74,13.74,13.859657142857142,13.859657142857142,13.859657142857142,13.859657142857142,13.859657142857142,13.86,13.86,13.86,13.86,13.86,13.86,13.875428571428571,13.394400000000001,13.394400000000001,13.394400000000001,13.469828571428572,13.469828571428572,13.469828571428572,13.469828571428572,13.4698285714286,13.4698285714286,14.196,14.710285714285714,14.710285714285714,14.710285714285714,14.710285714285714,14.710285714285714,14.684228571428575,14.684228571428575,14.684228571428575,14.6842285714286,14.6842285714286,14.6842285714286,16.033714285714286,16.033714285714286,16.033714285714286,16.033714285714286,16.033714285714286,16.033714285714286,16.03,16.03,16.03,16.03,16.03,15.59,16.02,16.02,16.02,16.02,16.02,16.739999999999998,16.739999999999998,16.739999999999998,16.739999999999998,16.739999999999998,16.64,16.64,16.71,15.92]
["EVN",14.325428571428571,14.325428571428571,14.325714285714286,14.3256,14.3256,13.985828571428572,13.985828571428572,13.985828571428572,14.069828571428571,14.069828571428571,14.069828571428571,14.069828571428571,14.516571428571428,14.458628571428571,14.458628571428571,14.458628571428571,14.458628571428571,14.458628571428571,14.458628571428571,14.458628571428571,14.458628571428571,14.458628571428571,14.042057142857146,14.042057142857146,14.36777142857143,14.36777142857143,14.36777142857143,14.487428571428572,14.487428571428572,14.487428571428572,14.487428571428572,14.487428571428572,14.487771428571429,14.487771428571429,14.487771428571429,14.487771428571429,14.487771428571429,14.487771428571429,14.5032,13.947771428571428,13.947771428571428,13.947771428571428,14.32422857142857,14.32422857142857,14.32422857142857,14.32422857142857,14.3242285714286,14.3242285714286,14.154857142857143,14.790514285714286,14.790514285714286,14.790514285714286,14.790514285714286,14.790514285714286,14.73942857142857,14.73942857142857,14.73942857142857,14.739428571428601,14.739428571428601,14.7394285714287,15.859142857142858,15.859142857142858,15.859142857142858,15.859142857142858,15.859142857142858,15.859142857142858,15.86,15.86,15.86,15.86,15.86,15.41,15.8,15.8,15.8,15.8,15.8,16.52,16.52,16.52,16.52,16.52,16.600000000000001,16.690000000000001,16.75,16.75]
["Wien Energie Stromnetz GmbH",14.756571428571428,14.756571428571428,14.756571428571428,14.091085714285715,14.091085714285715,14.091085714285715,14.091085714285715,14.091085714285715,14.090742857142859,14.090742857142859,14.090742857142859,14.090742857142859,13.763657142857145,13.705714285714285,13.705714285714285,13.705714285714285,13.705714285714285,13.705714285714285,13.705714285714285,13.705714285714285,13.705714285714285,13.705714285714285,13.377600000000001,13.377600000000001,13.703314285714288,13.703314285714288,13.703314285714288,13.822971428571432,13.822971428571432,13.822971428571432,13.822971428571432,13.822971428571432,13.823314285714286,13.823314285714286,13.823314285714286,13.823314285714286,13.823314285714286,13.823314285714286,13.838742857142856,13.337485714285714,13.337485714285714,13.337485714285714,13.713942857142856,13.713942857142856,13.713942857142856,13.713942857142856,13.7139428571429,13.7139428571429,13.675714285714285,14.189828571428572,14.189828571428572,14.189828571428572,14.189828571428572,14.189828571428572,14.12777142857143,14.12777142857143,14.12777142857143,14.1277714285714,14.1277714285714,14.1277714285713,15.321142857142858,15.321142857142858,15.321142857142858,15.321142857142858,15.321142857142858,15.321142857142858,15.32,15.32,15.32,15.32,15.32,14.89,15.5,15.5,15.5,15.5,15.5,16.22,16.22,16.22,16.22,16.22,16.3,16.3,16.399999999999999,16.579999999999998]
["Stromnetz Graz GmbH & Co KG",14.264857142857142,14.264857142857142,14.264857142857142,14.265257142857143,14.265257142857143,14.265257142857143,14.265257142857143,14.265257142857143,14.265257142857143,14.436685714285714,14.436685714285714,14.436685714285714,14.596457142857142,14.538514285714285,14.538514285714285,14.538514285714285,14.538514285714285,14.538514285714285,14.538514285714285,14.538514285714285,14.538514285714285,14.538514285714285,14.538514285714285,14.538514285714285,14.113714285714286,14.113714285714286,14.113714285714286,14.233371428571429,14.233371428571429,14.233371428571429,14.233371428571429,14.233371428571429,14.233714285714285,14.233714285714285,14.233714285714285,14.233714285714285,14.233714285714285,14.233714285714285,14.249142857142857,14.249142857142857,14.249142857142857,13.3762857142857,13.752685714285715,13.752685714285715,13.752685714285715,13.752685714285715,13.7526857142857,13.7526857142857,13.483428571428572,13.99782857142857,13.99782857142857,13.99782857142857,13.99782857142857,13.99782857142857,13.961828571428571,13.961828571428571,13.961828571428571,13.961828571428599,13.961828571428599,13.9618285714287,15.061428571428571,15.061428571428571,15.061428571428571,15.061428571428571,15.061428571428571,15.061428571428571,15.06,15.06,15.06,15.06,15.06,14.62,14.93,14.93,14.93,14.93,14.93,15.65,15.65,15.65,15.65,15.65,15.55,15.55,15.49,14.83]
["Tiwag",12.683714285714286,12.683714285714286,12.683714285714286,12.683657142857143,12.683657142857143,12.683657142857143,12.683657142857143,12.683657142857143,12.683657142857143,12.57737142857143,12.57737142857143,12.57737142857143,13.132114285714286,13.074171428571429,13.074171428571429,13.074171428571429,13.074171428571429,13.074171428571429,13.074171428571429,13.074171428571429,13.074171428571429,13.074171428571429,12.457714285714285,12.457714285714285,13.770857142857144,13.770857142857144,13.770857142857144,13.890514285714286,13.890514285714286,13.890514285714286,13.890514285714286,13.890514285714286,13.890857142857143,13.890857142857143,13.890857142857143,13.823657142857144,13.823657142857144,13.823657142857144,13.906285714285715,13.521942857142855,13.521942857142855,13.521942857142855,13.898399999999999,13.898399999999999,13.898399999999999,13.898399999999999,13.898400000000001,13.898400000000001,13.467428571428572,13.981714285714286,13.981714285714286,13.981714285714286,13.981714285714286,13.981714285714286,13.497942857142856,13.497942857142856,13.497942857142856,13.497942857142901,13.497942857142901,13.497942857143,15.276,15.276,15.276,15.276,15.276,15.276,15.28,15.28,15.28,15.28,15.28,14.83,15.28,15.28,15.28,15.28,15.28,15.8,15.8,15.8,15.8,15.8,15.8,15.8,15.9,15.2]
["IKB",12.692285714285715,12.692285714285715,12.692285714285715,12.692228571428572,12.692228571428572,12.692228571428572,12.692228571428572,12.692228571428572,12.692228571428572,12.40457142857143,12.40457142857143,12.40457142857143,12.918171428571428,13.052914285714285,13.052914285714285,13.052914285714285,13.052914285714285,13.052914285714285,13.052914285714285,13.052914285714285,13.052914285714285,13.052914285714285,12.793028571428573,12.793028571428573,13.118742857142859,13.119085714285715,13.119085714285715,13.238742857142856,13.238742857142856,13.238742857142856,13.238742857142856,13.238742857142856,13.239085714285716,13.171885714285716,13.171885714285716,13.171885714285716,13.171885714285716,13.171885714285716,13.254514285714286,12.892457142857143,12.892457142857143,12.892457142857143,13.515085714285714,13.515085714285714,13.515085714285714,13.515085714285714,13.5150857142857,13.5150857142857,13.324,13.508914285714287,13.508914285714287,13.508914285714287,13.508914285714287,13.508914285714287,13.962514285714285,13.962514285714285,13.962514285714285,13.962514285714301,13.962514285714301,13.962514285714301,14.77,14.77,14.77,14.77,14.77,14.77,14.77,14.77,14.77,14.77,14.77,14.33,14.69,14.69,14.69,14.69,14.69,15.41,15.41,15.41,15.41,15.41,15.49,15.49,15.53,16.05]
["Energie Klagenfurt GmbH",12.483428571428572,12.483428571428572,12.483428571428572,12.483428571428572,12.483428571428572,12.483428571428572,12.483428571428572,12.483428571428572,12.483428571428572,12.534514285714286,12.534514285714286,12.534514285714286,13.038514285714285,12.980571428571428,12.980571428571428,12.980571428571428,12.980571428571428,12.980571428571428,12.980571428571428,12.980571428571428,12.980571428571428,12.980571428571428,12.615428571428572,12.615428571428572,12.941142857142857,12.941142857142857,12.941142857142857,13.0608,13.0608,13.0608,13.0608,13.0608,13.061142857142856,12.993942857142857,12.993942857142857,12.993942857142857,12.993942857142857,12.652799999999999,12.652799999999999,12.652799999999999,12.652799999999999,12.652799999999999,13.029257142857142,13.029257142857142,13.029257142857142,13.029257142857142,13.0292571428571,13.0292571428571,12.919714285714285,13.43382857142857,13.43382857142857,13.43382857142857,13.43382857142857,13.43382857142857,13.402285714285714,13.402285714285714,13.402285714285714,13.4022857142857,13.4022857142857,13.4022857142857,13.89,13.89,13.89,13.89,13.89,13.89,13.89,13.89,13.89,13.89,13.89,13.44,13.77,13.77,13.77,13.77,13.77,14.49,14.49,14.49,14.49,14.49,14.57,14.57,14.76,14.76]
["STEG",15.605142857142855,15.605142857142855,15.605142857142855,15.605485714285715,15.605485714285715,15.605485714285715,15.605485714285715,15.605485714285715,15.605142857142855,15.776571428571428,15.776571428571428,15.776571428571428,15.936342857142856,15.878400000000001,15.878400000000001,15.878400000000001,15.878400000000001,15.878400000000001,15.878400000000001,15.878400000000001,15.878400000000001,15.878400000000001,15.878400000000001,15.878400000000001]
[null,{"$f":"AVERAGE(B41:B54)","v":14.653040816326527},14.660448979591834,14.667163265306119,14.547257142857145,14.43962448979592,14.399632653061227,14.391502040816325,14.41618775510204,14.417363265306124,14.429608163265311,14.429608163265311,14.429608163265311,14.722726530612245,14.679159183673468,14.699314285714285,14.71545306122449,14.706636734693877,14.706636734693877,14.706636734693877,14.706636734693877,14.706636734693877,14.706636734693877,14.438253061224488,14.438253061224488,14.708228571428574,14.708254945054948,14.708254945054948,14.827912087912088,14.827912087912088,14.827912087912088,14.827912087912088,14.827226373626372,{"$f":"AVERAGE(AH41:AH54)","v":14.827569230769235},14.77563956043956,14.793942857142856,14.788773626373626,14.788773626373626,14.547870329670328,14.545345054945056,14.372782417582417,14.372782417582417,14.062826373626361,14.396043956043957,14.396043956043957,14.396043956043957,14.396043956043957,14.396043956043968,14.396043956043968,14.229296703296702,14.734786813186812,14.734786813186812,14.734786813186812,14.734786813186812,14.734786813186812,14.693723076923078,14.693723076923078,14.693723076923078,14.693723076923087,14.693723076923087,14.69372307692309,15.801362637362637,15.801362637362637,15.801362637362637,15.801362637362637,{"$f":"AVERAGE(BN41:BN54)","v":15.801362637362637},15.801362637362637,15.801538461538463,15.801538461538463,15.801538461538463,15.801538461538463,15.801538461538463,15.357692307692311,15.75,15.75,15.75,15.75,15.75,16.454615384615384,16.454615384615384,16.454615384615384,16.454615384615384,16.454615384615384,16.424615384615386,16.437692307692313,16.411538461538463,16.013846153846156]
[]
[]
[]
[]
[]
[]
[]
[]
[]
[]
[]
[]
[]
[]
[]
[]
[]
[]
[]
[]
[]
[]
[]
[]
[]
[]
[]
[]
[]
[]
[]
[]
[]
[]
[]
[]
[]
[]
[null,"Derzeit durchschnittlicher Strompreis:",null,null,null,null,{"$f":"CI55","v":16.013846153846156},"cent/kWh"]
[null,"Derzeit Ökostrompreis (ökostrom-ag):",null,null,null,null,21.5,"cent/kWh"]
[null,"Einspeisepreis für Ökostrom:",null,null,null,null,5.59,"cent/kWh"]
[]
[]
[]
[]
[]
[{"$f":"$B$55*(1+(D102/100))^7","v":16.26260280854213},null,null,1.5]
[{"$f":"Eingabe!#REF!*(1+(Eingabe!$G$71/100))^Berechnungen!#REF!","v":{"$error":"#REF!"}}]
[{"$f":"Eingabe!#REF!*(1+(Eingabe!$G$71/100))^Berechnungen!#REF!","v":{"$error":"#REF!"}}]
[{"$f":"Eingabe!#REF!*(1+(Eingabe!$G$71/100))^Berechnungen!#REF!","v":{"$error":"#REF!"}}]
[{"$f":"Eingabe!#REF!*(1+(Eingabe!$G$71/100))^Berechnungen!#REF!","v":{"$error":"#REF!"}}]
[{"$f":"Eingabe!#REF!*(1+(Eingabe!$G$71/100))^Berechnungen!#REF!","v":{"$error":"#REF!"}}]
[{"$f":"Eingabe!#REF!*(1+(Eingabe!$G$71/100))^Berechnungen!#REF!","v":{"$error":"#REF!"}}]
[{"$f":"Eingabe!#REF!*(1+(Eingabe!$G$71/100))^Berechnungen!#REF!","v":{"$error":"#REF!"}}]
[{"$f":"Eingabe!#REF!*(1+(Eingabe!$G$71/100))^Berechnungen!#REF!","v":{"$error":"#REF!"}}]
[{"$f":"Eingabe!#REF!*(1+(Eingabe!$G$71/100))^Berechnungen!#REF!","v":{"$error":"#REF!"}}]
[{"$f":"Eingabe!#REF!*(1+(Eingabe!$G$71/100))^Berechnungen!#REF!","v":{"$error":"#REF!"}}]
[{"$f":"Eingabe!#REF!*(1+(Eingabe!$G$71/100))^Berechnungen!#REF!","v":{"$error":"#REF!"}}]
[{"$f":"Eingabe!#REF!*(1+(Eingabe!$G$71/100))^Berechnungen!#REF!","v":{"$error":"#REF!"}}]
[{"$f":"Eingabe!#REF!*(1+(Eingabe!$G$71/100))^Berechnungen!#REF!","v":{"$error":"#REF!"}}]
[{"$f":"Eingabe!#REF!*(1+(Eingabe!$G$71/100))^Berechnungen!#REF!","v":{"$error":"#REF!"}}]
[{"$f":"Eingabe!#REF!*(1+(Eingabe!$G$71/100))^Berechnungen!#REF!","v":{"$error":"#REF!"}}]
[{"$f":"Eingabe!#REF!*(1+(Eingabe!$G$71/100))^Berechnungen!#REF!","v":{"$error":"#REF!"}}]
[{"$f":"Eingabe!#REF!*(1+(Eingabe!$G$71/100))^Berechnungen!#REF!","v":{"$error":"#REF!"}}]
[{"$f":"Eingabe!#REF!*(1+(Eingabe!$G$71/100))^Berechnungen!#REF!","v":{"$error":"#REF!"}}]
[{"$f":"Eingabe!#REF!*(1+(Eingabe!$G$71/100))^Berechnungen!#REF!","v":{"$error":"#REF!"}}]
[{"$f":"Eingabe!#REF!*(1+(Eingabe!$G$71/100))^Berechnungen!#REF!","v":{"$error":"#REF!"}}]
[{"$f":"Eingabe!#REF!*(1+(Eingabe!$G$71/100))^Berechnungen!#REF!","v":{"$error":"#REF!"}}]
[{"$f":"Eingabe!#REF!*(1+(Eingabe!$G$71/100))^Berechnungen!#REF!","v":{"$error":"#REF!"}}]
[{"$f":"Eingabe!#REF!*(1+(Eingabe!$G$71/100))^Berechnungen!#REF!","v":{"$error":"#REF!"}}]
[{"$f":"Eingabe!#REF!*(1+(Eingabe!$G$71/100))^Berechnungen!#REF!","v":{"$error":"#REF!"}}]

{"sheet":"Motorbez. Versicherungssteuer","index":10,"n_rows":509,"n_cols":22,"rows_kept":509,"cut":false,"hidden":true,"merged":[[6,6,6,9],[7,6,7,9],[6,2,6,5],[7,2,7,5],[0,11,0,15],[0,4,0,7],[0,0,0,2],[1,4,1,7]]}
["Berechung NEU",null,null,null,"Motorbezogene Versicherungssteuer NEU",null,null,null,null,null,null,"Werte ab 01.10.2020",null,null,null,null,null,"Jahr",null,"Jahr der Anschaffung","CO2 Grenzwert","Leistung Grenzwert"]
["jährliche",null,{"$f":"(IF((Eingabe!M17-$O$5)>5,(Eingabe!M17-$O$5)*$M$5,5*$M$5)+IF((Eingabe!M22-$O$3)>5,(Eingabe!M22-$O$3)*$M$3,5*$M$3))*12","v":328.32},null,{"$f":"VLOOKUP(Eingabe!C42,'Motorbez. Versicherungssteuer'!A2:C5,3,FALSE)","v":328.32},null,null,null,null,null,null,null,null,null,null,null,null,null,null,"[a]","[g/km]","[kW]"]
["½-jährliche",null,{"$f":"(IF((Eingabe!M17-$O$5)>5,(Eingabe!M17-$O$5)*$M$5,5*$M$5)+IF((Eingabe!M22-$O$3)>5,(Eingabe!M22-$O$3)*$M$3,5*$M$3))*6","v":164.16},null,null,null,null,null,null,null,null,"CO2",0.72,"€ pro g/km ab",{"$f":"VLOOKUP(R3,T3:V7,2,TRUE)","v":115},"g/km",null,2020,null,2020,115,65]
["¼-jährliche",null,{"$f":"(IF((Eingabe!M17-$O$5)>5,(Eingabe!M17-$O$5)*$M$5,5*$M$5)+IF((Eingabe!M22-$O$3)>5,(Eingabe!M22-$O$3)*$M$3,5*$M$3))*3","v":82.08},null,null,null,null,null,null,null,null,null,null,null,null,null,null,null,null,2021,112,64]
["monatliche",null,{"$f":"(IF((Eingabe!M17-$O$5)>5,(Eingabe!M17-$O$5)*$M$5,5*$M$5)+IF((Eingabe!M22-$O$3)>5,(Eingabe!M22-$O$3)*$M$3,5*$M$3))","v":27.36},null,null,null,null,null,null,null,null,"Leistung",0.72,"€ pro kW ab ",{"$f":"VLOOKUP(R3,T3:V7,3,TRUE)","v":65},"kW",null,null,null,2022,109,63]
[null,null,null,null,null,null,null,null,null,null,null,null,null,null,null,null,null,null,null,2023,106,62]
["Leistung","Staffelung","Motorbezogene Versicherungssteuer (spezifisch)",null,null,null,"Absolutbeträge",null,null,null,null,null,null,null,null,null,null,null,null,2024,103,61]
["[kW]",null,"[€/kW und Monat]",null,null,null,"[€/a]"]
[null,null,"jährliche","½-jährliche","¼-jährliche","monatliche","jährliche","½-jährliche","¼-jährliche","monatliche"]
[1,1,0,0,0,0,{"$f":"C10*A10*12","v":0},{"$f":"D10*B10*12","v":0},0,0]
[2,2,0,0,0,0,{"$f":"C11*A11*12","v":0},0,0,0]
[3,3,0,0,0,0,0,0,0,0]
[4,4,0,0,0,0,0,0,0,0]
[5,5,0,0,0,0,0,0,0,0]
[6,6,0,0,0,0,0,0,0,0]
[7,7,0,0,0,0,0,0,0,0]
[8,8,0,0,0,0,0,0,0,0]
[9,9,0,0,0,0,0,0,0,0]
[10,10,0,0,0,0,0,0,0,0]
[11,11,0,0,0,0,0,0,0,0]
[12,12,0,0,0,0,0,0,0,0]
[13,13,0,0,0,0,0,0,0,0]
[14,14,0,0,0,0,0,0,0,0]
[15,15,0,0,0,0,0,0,0,0]
[16,16,0,0,0,0,0,0,0,0]
[17,17,0,0,0,0,0,{"$f":"D26*B26*12","v":0},{"$f":"E26*C26*12","v":0},{"$f":"F26*D26*12","v":0}]
[18,18,0,0,0,0,0,0,0,0]
[19,19,0,0,0,0,0,0,0,0]
[20,20,0,0,0,0,0,0,0,0]
[21,21,0,0,0,0,0,0,0,0]
[22,22,0,0,0,0,0,0,0,0]
[23,23,0,0,0,0,0,0,0,0]
[24,24,0,0,0,0,0,0,0,0]
[25,1,0.62,0.65720000000000001,0.66959999999999997,0.68200000000000005,{"$f":"C34*$B34*12","v":7.4399999999999995},{"$f":"D34*$B34*12","v":7.8864000000000001},8.0351999999999997,8.1840000000000011]
[26,2,0.62,0.65720000000000001,0.66959999999999997,0.68200000000000005,{"$f":"C35*$B35*12","v":14.879999999999999},15.7728,16.070399999999999,16.368000000000002]
[27,3,0.62,0.65720000000000001,0.66959999999999997,0.68200000000000005,22.32,23.659199999999998,24.105599999999999,24.552000000000003]
[28,4,0.62,0.65720000000000001,0.66959999999999997,0.68200000000000005,29.759999999999998,31.5456,32.140799999999999,32.736000000000004]
[29,5,0.62,0.65720000000000001,0.66959999999999997,0.68200000000000005,37.200000000000003,39.432000000000002,40.176000000000002,40.92]
[30,6,0.62,0.65720000000000001,0.66959999999999997,0.68200000000000005,44.64,47.318399999999997,48.211199999999998,49.104000000000006]
[31,7,0.62,0.65720000000000001,0.66959999999999997,0.68200000000000005,52.08,55.204800000000006,56.246399999999994,57.287999999999997]
[32,8,0.62,0.65720000000000001,0.66959999999999997,0.68200000000000005,59.519999999999996,63.091200000000001,64.281599999999997,65.472000000000008]
[33,9,0.62,0.65720000000000001,0.66959999999999997,0.68200000000000005,66.960000000000008,70.977599999999995,72.316800000000001,73.656000000000006]
[34,10,0.62,0.65720000000000001,0.66959999999999997,0.68200000000000005,74.400000000000006,78.864000000000004,80.352000000000004,81.84]
[35,11,0.62,0.65720000000000001,0.66959999999999997,0.68200000000000005,81.84,86.750400000000013,88.387199999999993,90.024000000000001]
[36,12,0.62,0.65720000000000001,0.66959999999999997,0.68200000000000005,89.28,94.636799999999994,96.422399999999996,98.208000000000013]
[37,13,0.62,0.65720000000000001,0.66959999999999997,0.68200000000000005,96.72,102.5232,104.45759999999999,106.39200000000002]
[38,14,0.62,0.65720000000000001,0.66959999999999997,0.68200000000000005,104.16,110.40960000000001,112.49279999999999,114.57599999999999]
[39,15,0.62,0.65720000000000001,0.66959999999999997,0.68200000000000005,111.60000000000001,118.29600000000001,120.52800000000001,122.76]
[40,16,0.62,0.65720000000000001,0.66959999999999997,0.68200000000000005,119.03999999999999,126.1824,128.56319999999999,130.94400000000002]
[41,17,0.62,0.65720000000000001,0.66959999999999997,0.68200000000000005,126.47999999999999,{"$f":"D50*$B50*12","v":134.06880000000001},{"$f":"E50*$B50*12","v":136.59839999999997},{"$f":"F50*$B50*12","v":139.12800000000001}]
[42,18,0.62,0.65720000000000001,0.66959999999999997,0.68200000000000005,133.92000000000002,141.95519999999999,144.6336,147.31200000000001]
[43,19,0.62,0.65720000000000001,0.66959999999999997,0.68200000000000005,141.35999999999999,149.8416,152.6688,155.49600000000001]
[44,20,0.62,0.65720000000000001,0.66959999999999997,0.68200000000000005,148.80000000000001,157.72800000000001,160.70400000000001,163.68]
[45,21,0.62,0.65720000000000001,0.66959999999999997,0.68200000000000005,156.24,165.61439999999999,168.73919999999998,171.864]
[46,22,0.62,0.65720000000000001,0.66959999999999997,0.68200000000000005,163.68,173.50080000000003,176.77439999999999,180.048]
[47,23,0.62,0.65720000000000001,0.66959999999999997,0.68200000000000005,171.12,181.38720000000001,184.80959999999999,188.23200000000003]
[48,24,0.62,0.65720000000000001,0.66959999999999997,0.68200000000000005,178.56,189.27359999999999,192.84479999999999,196.41600000000003]
[49,25,0.62,0.65720000000000001,0.66959999999999997,0.68200000000000005,186,197.16,200.88,204.60000000000002]
[50,26,0.62,0.65720000000000001,0.66959999999999997,0.68200000000000005,193.44,205.04640000000001,208.91519999999997,212.78400000000005]
[51,27,0.62,0.65720000000000001,0.66959999999999997,0.68200000000000005,200.88,212.93279999999999,216.9504,220.96800000000002]
[52,28,0.62,0.65720000000000001,0.66959999999999997,0.68200000000000005,208.32,220.81920000000002,224.98559999999998,229.15199999999999]
[53,29,0.62,0.65720000000000001,0.66959999999999997,0.68200000000000005,215.76,228.7056,233.02079999999998,237.33600000000001]
[54,30,0.62,0.65720000000000001,0.66959999999999997,0.68200000000000005,223.20000000000002,236.59200000000001,241.05600000000001,245.52]
[55,31,0.62,0.65720000000000001,0.66959999999999997,0.68200000000000005,230.64,244.47840000000002,249.09120000000001,253.70400000000004]
[56,32,0.62,0.65720000000000001,0.66959999999999997,0.68200000000000005,238.07999999999998,252.3648,257.12639999999999,261.88800000000003]
[57,33,0.62,0.65720000000000001,0.66959999999999997,0.68200000000000005,245.52,260.25119999999998,265.16159999999996,270.072]
[58,34,0.62,0.65720000000000001,0.66959999999999997,0.68200000000000005,252.95999999999998,268.13760000000002,273.19679999999994,278.25600000000003]
[59,35,0.62,0.65720000000000001,0.66959999999999997,0.68200000000000005,260.39999999999998,276.024,281.23199999999997,286.44]
[60,36,0.62,0.65720000000000001,0.66959999999999997,0.68200000000000005,267.84000000000003,283.91039999999998,289.2672,294.62400000000002]
[61,37,0.62,0.65720000000000001,0.66959999999999997,0.68200000000000005,275.28000000000003,291.79680000000002,297.30239999999998,302.80799999999999]
[62,38,0.62,0.65720000000000001,0.66959999999999997,0.68200000000000005,282.71999999999997,299.6832,305.33760000000001,310.99200000000002]
[63,39,0.62,0.65720000000000001,0.66959999999999997,0.68200000000000005,290.15999999999997,307.56960000000004,313.37279999999998,319.17600000000004]
[64,40,0.62,0.65720000000000001,0.66959999999999997,0.68200000000000005,297.60000000000002,315.45600000000002,321.40800000000002,327.36]
[65,41,0.62,0.65720000000000001,0.66959999999999997,0.68200000000000005,305.03999999999996,323.3424,329.44319999999999,335.54400000000004]
[66,42,0.62,0.65720000000000001,0.66959999999999997,0.68200000000000005,312.48,331.22879999999998,337.47839999999997,343.72800000000001]
[67,43,0.62,0.65720000000000001,0.66959999999999997,0.68200000000000005,319.92,339.11519999999996,345.5136,351.91200000000003]
[68,44,0.62,0.65720000000000001,0.66959999999999997,0.68200000000000005,327.36,347.00160000000005,353.54879999999997,360.096]
[69,45,0.62,0.65720000000000001,0.66959999999999997,0.68200000000000005,334.79999999999995,354.88800000000003,361.58399999999995,368.28000000000003]
[70,46,0.62,0.65720000000000001,0.66959999999999997,0.68200000000000005,342.24,362.77440000000001,369.61919999999998,376.46400000000006]
[71,47,0.62,0.65720000000000001,0.66959999999999997,0.68200000000000005,349.68,370.66079999999999,377.65440000000001,384.64800000000002]
[72,48,0.62,0.65720000000000001,0.66959999999999997,0.68200000000000005,357.12,378.54719999999998,385.68959999999998,392.83200000000005]
[73,49,0.62,0.65720000000000001,0.66959999999999997,0.68200000000000005,364.56,386.43360000000007,393.72480000000002,401.01599999999996]
[74,50,0.62,0.65720000000000001,0.66959999999999997,0.68200000000000005,372,394.32,401.76,409.20000000000005]
[75,51,0.62,0.65720000000000001,0.66959999999999997,0.68200000000000005,379.44,402.20640000000003,409.79520000000002,417.38400000000001]
[76,52,0.62,0.65720000000000001,0.66959999999999997,0.68200000000000005,386.88,410.09280000000001,417.83039999999994,425.5680000000001]
[77,53,0.62,0.65720000000000001,0.66959999999999997,0.68200000000000005,394.32,417.97919999999999,425.86559999999997,433.75200000000001]
[78,54,0.62,0.65720000000000001,0.66959999999999997,0.68200000000000005,401.76,425.86559999999997,433.9008,441.93600000000004]
[79,55,0.62,0.65720000000000001,0.66959999999999997,0.68200000000000005,409.20000000000005,433.75200000000001,441.93599999999992,450.12000000000006]
[80,56,0.62,0.65720000000000001,0.66959999999999997,0.68200000000000005,416.64,441.63840000000005,449.97119999999995,458.30399999999997]
[81,57,0.62,0.65720000000000001,0.66959999999999997,0.68200000000000005,424.07999999999993,449.52480000000003,458.00639999999999,466.48800000000006]
[82,58,0.62,0.65720000000000001,0.66959999999999997,0.68200000000000005,431.52,457.41120000000001,466.04159999999996,474.67200000000003]
[83,59,0.62,0.65720000000000001,0.66959999999999997,0.68200000000000005,438.96,465.29759999999999,474.07679999999999,482.85599999999999]
[84,60,0.62,0.65720000000000001,0.66959999999999997,0.68200000000000005,446.40000000000003,473.18400000000003,482.11200000000002,491.04]
[85,61,0.62,0.65720000000000001,0.66959999999999997,0.68200000000000005,453.84000000000003,481.07039999999995,490.1472,499.22400000000005]
[86,62,0.62,0.65720000000000001,0.66959999999999997,0.68200000000000005,461.28,488.95680000000004,498.18240000000003,507.40800000000007]
[87,63,0.62,0.65720000000000001,0.66959999999999997,0.68200000000000005,468.72,496.84319999999997,506.21759999999995,515.59199999999998]
[88,64,0.62,0.65720000000000001,0.66959999999999997,0.68200000000000005,476.15999999999997,504.7296,514.25279999999998,523.77600000000007]
[89,65,0.62,0.65720000000000001,0.66959999999999997,0.68200000000000005,483.59999999999997,512.61599999999999,522.28800000000001,531.96]
[90,66,0.62,0.65720000000000001,0.66959999999999997,0.68200000000000005,{"$f":"C99*$B99*12","v":491.04},520.50239999999997,530.32319999999993,540.14400000000001]
[91,1,0.66,0.6996,0.71279999999999999,0.72599999999999998,{"$f":"G$99+C100*$B100*12","v":498.96000000000004},{"$f":"H$99+D100*$B100*12","v":528.89760000000001},538.87679999999989,548.85599999999999]
[92,2,0.66,0.6996,0.71279999999999999,0.72599999999999998,{"$f":"G$99+C101*$B101*12","v":506.88},537.29279999999994,547.43039999999996,557.56799999999998]
[93,3,0.66,0.6996,0.71279999999999999,0.72599999999999998,514.80000000000007,545.68799999999999,555.98399999999992,566.28]
[94,4,0.66,0.6996,0.71279999999999999,0.72599999999999998,522.72,554.08319999999992,564.53759999999988,574.99199999999996]
[95,5,0.66,0.6996,0.71279999999999999,0.72599999999999998,530.64,562.47839999999997,573.09119999999996,583.70399999999995]
[96,6,0.66,0.6996,0.71279999999999999,0.72599999999999998,538.56000000000006,570.87360000000001,581.64479999999992,592.41600000000005]
[97,7,0.66,0.6996,0.71279999999999999,0.72599999999999998,546.48,579.26879999999994,590.19839999999999,601.12800000000004]
[98,8,0.66,0.6996,0.71279999999999999,0.72599999999999998,554.4,587.66399999999999,598.75199999999995,609.84]
[99,9,0.66,0.6996,0.71279999999999999,0.72599999999999998,562.32000000000005,596.05919999999992,607.30559999999991,618.55200000000002]
[100,10,0.66,0.6996,0.71279999999999999,0.72599999999999998,570.24,604.45439999999996,615.85919999999987,627.26400000000001]
[101,11,0.66,0.6996,0.71279999999999999,0.72599999999999998,578.16000000000008,612.84960000000001,624.41279999999995,635.976]
[102,12,0.66,0.6996,0.71279999999999999,0.72599999999999998,586.08000000000004,621.24479999999994,632.96639999999991,644.68799999999999]
[103,13,0.66,0.6996,0.71279999999999999,0.72599999999999998,594,629.64,641.52,653.4]
[104,14,0.66,0.6996,0.71279999999999999,0.72599999999999998,601.92000000000007,638.03519999999992,650.07359999999994,662.11199999999997]
[105,15,0.66,0.6996,0.71279999999999999,0.72599999999999998,609.84,646.43039999999996,658.6271999999999,670.82400000000007]
[106,16,0.66,0.6996,0.71279999999999999,0.72599999999999998,617.76,654.82559999999989,667.18079999999986,679.53600000000006]
[107,17,0.66,0.6996,0.71279999999999999,0.72599999999999998,625.68000000000006,{"$f":"H$99+D116*$B116*12","v":663.22079999999994},{"$f":"I$99+E116*$B116*12","v":675.73439999999994},{"$f":"J$99+F116*$B116*12","v":688.24800000000005}]
[108,18,0.66,0.6996,0.71279999999999999,0.72599999999999998,633.6,671.61599999999999,684.2879999999999,696.96]
[109,19,0.66,0.6996,0.71279999999999999,0.72599999999999998,641.52,680.01119999999992,692.84159999999997,705.67200000000003]
[110,20,0.66,0.6996,0.71279999999999999,0.72599999999999998,649.44000000000005,688.40639999999996,701.39519999999993,714.38400000000001]
[111,1,0.75,0.79500000000000004,0.81,0.82499999999999996,{"$f":"G$119+$B120*C120*12","v":658.44},{"$f":"H$119+$B120*D120*12","v":697.94639999999993},711.11519999999996,724.28399999999999]
[112,2,0.75,0.79500000000000004,0.81,0.82499999999999996,{"$f":"G$119+$B121*C121*12","v":667.44},707.4864,720.83519999999999,734.18399999999997]
[113,3,0.75,0.79500000000000004,0.81,0.82499999999999996,676.44,717.02639999999997,730.5551999999999,744.08400000000006]
[114,4,0.75,0.79500000000000004,0.81,0.82499999999999996,685.44,726.56639999999993,740.27519999999993,753.98400000000004]
[115,5,0.75,0.79500000000000004,0.81,0.82499999999999996,694.44,736.10640000000001,749.99519999999995,763.88400000000001]
[116,6,0.75,0.79500000000000004,0.81,0.82499999999999996,703.44,745.64639999999997,759.71519999999998,773.78399999999999]
[117,7,0.75,0.79500000000000004,0.81,0.82499999999999996,712.44,755.18639999999994,769.4351999999999,783.68399999999997]
[118,8,0.75,0.79500000000000004,0.81,0.82499999999999996,721.44,764.72640000000001,779.15519999999992,793.58400000000006]
[119,9,0.75,0.79500000000000004,0.81,0.82499999999999996,730.44,774.26639999999998,788.87519999999995,803.48400000000004]
[120,10,0.75,0.79500000000000004,0.81,0.82499999999999996,739.44,783.80639999999994,798.59519999999998,813.38400000000001]
[121,11,0.75,0.79500000000000004,0.81,0.82499999999999996,748.44,793.34640000000002,808.31519999999989,823.28399999999999]
[122,12,0.75,0.79500000000000004,0.81,0.82499999999999996,757.44,802.88639999999998,818.03519999999992,833.18399999999997]
[123,13,0.75,0.79500000000000004,0.81,0.82499999999999996,766.44,812.42639999999994,827.75519999999995,843.08400000000006]
[124,14,0.75,0.79500000000000004,0.81,0.82499999999999996,775.44,821.96640000000002,837.47519999999986,852.98400000000004]
[125,15,0.75,0.79500000000000004,0.81,0.82499999999999996,784.44,831.50639999999999,847.19519999999989,862.88400000000001]
[126,16,0.75,0.79500000000000004,0.81,0.82499999999999996,793.44,841.04639999999995,856.91519999999991,872.78399999999999]
[127,17,0.75,0.79500000000000004,0.81,0.82499999999999996,802.44,{"$f":"H$119+$B136*D136*12","v":850.58639999999991},{"$f":"I$119+$B136*E136*12","v":866.63519999999994},{"$f":"J$119+$B136*F136*12","v":882.68399999999997}]
[128,18,0.75,0.79500000000000004,0.81,0.82499999999999996,811.44,860.12639999999999,876.35519999999997,892.58400000000006]
[129,19,0.75,0.79500000000000004,0.81,0.82499999999999996,820.44,869.66639999999995,886.0752,902.48400000000004]
[130,20,0.75,0.79500000000000004,0.81,0.82499999999999996,829.44,879.20640000000003,895.79520000000002,912.38400000000001]
[131,21,0.75,0.79500000000000004,0.81,0.82499999999999996,838.44,888.74639999999999,905.51519999999994,922.28399999999999]
[132,22,0.75,0.79500000000000004,0.81,0.82499999999999996,847.44,898.28639999999996,915.23519999999996,932.18399999999997]
[133,23,0.75,0.79500000000000004,0.81,0.82499999999999996,856.44,907.82639999999992,924.95519999999999,942.08400000000006]
[134,24,0.75,0.79500000000000004,0.81,0.82499999999999996,865.44,917.3664,934.6751999999999,951.98399999999992]
[135,25,0.75,0.79500000000000004,0.81,0.82499999999999996,874.44,926.90639999999996,944.39519999999993,961.88400000000001]
[136,26,0.75,0.79500000000000004,0.81,0.82499999999999996,883.44,936.44640000000004,954.11519999999996,971.78399999999999]
[137,27,0.75,0.79500000000000004,0.81,0.82499999999999996,892.44,945.9864,963.83519999999999,981.68399999999997]
[138,28,0.75,0.79500000000000004,0.81,0.82499999999999996,901.44,955.52639999999997,973.5551999999999,991.58400000000006]
[139,29,0.75,0.79500000000000004,0.81,0.82499999999999996,910.44,965.06639999999993,983.27519999999993,1001.4839999999999]
[140,30,0.75,0.79500000000000004,0.81,0.82499999999999996,919.44,974.60640000000001,992.99519999999995,1011.384]
[141,31,0.75,0.79500000000000004,0.81,0.82499999999999996,928.44,984.14639999999997,1002.7152,1021.284]
[142,32,0.75,0.79500000000000004,0.81,0.82499999999999996,937.44,993.68640000000005,1012.4351999999999,1031.184]
[143,33,0.75,0.79500000000000004,0.81,0.82499999999999996,946.44,1003.2264,1022.1551999999999,1041.0840000000001]
[144,34,0.75,0.79500000000000004,0.81,0.82499999999999996,955.44,1012.7664,1031.8751999999999,1050.9839999999999]
[145,35,0.75,0.79500000000000004,0.81,0.82499999999999996,964.44,1022.3063999999999,1041.5952,1060.884]
[146,36,0.75,0.79500000000000004,0.81,0.82499999999999996,973.44,1031.8463999999999,1051.3152,1070.7840000000001]
[147,37,0.75,0.79500000000000004,0.81,0.82499999999999996,982.44,1041.3863999999999,1061.0352,1080.684]
[148,38,0.75,0.79500000000000004,0.81,0.82499999999999996,991.44,1050.9263999999998,1070.7552000000001,1090.5840000000001]
[149,39,0.75,0.79500000000000004,0.81,0.82499999999999996,1000.44,1060.4664,1080.4751999999999,1100.4839999999999]
[150,40,0.75,0.79500000000000004,0.81,0.82499999999999996,1009.44,1070.0064,1090.1952000000001,1110.384]
[151,41,0.75,0.79500000000000004,0.81,0.82499999999999996,1018.44,1079.5463999999999,1099.9151999999999,1120.2840000000001]
[152,42,0.75,0.79500000000000004,0.81,0.82499999999999996,1027.44,1089.0863999999999,1109.6351999999999,1130.184]
[153,43,0.75,0.79500000000000004,0.81,0.82499999999999996,1036.44,1098.6264000000001,1119.3552,1140.0840000000001]
[154,44,0.75,0.79500000000000004,0.81,0.82499999999999996,1045.44,1108.1664000000001,1129.0752,1149.9839999999999]
[155,45,0.75,0.79500000000000004,0.81,0.82499999999999996,1054.44,1117.7064,1138.7952,1159.884]
[156,46,0.75,0.79500000000000004,0.81,0.82499999999999996,1063.44,1127.2464,1148.5152,1169.7840000000001]
[157,47,0.75,0.79500000000000004,0.81,0.82499999999999996,1072.44,1136.7864,1158.2352000000001,1179.684]
[158,48,0.75,0.79500000000000004,0.81,0.82499999999999996,1081.44,1146.3263999999999,1167.9551999999999,1189.5839999999998]
[159,49,0.75,0.79500000000000004,0.81,0.82499999999999996,1090.44,1155.8663999999999,1177.6752000000001,1199.4839999999999]
[160,50,0.75,0.79500000000000004,0.81,0.82499999999999996,1099.44,1165.4063999999998,1187.3951999999999,1209.384]
[161,51,0.75,0.79500000000000004,0.81,0.82499999999999996,1108.44,1174.9464,1197.1152,1219.2840000000001]
[162,52,0.75,0.79500000000000004,0.81,0.82499999999999996,1117.44,1184.4864,1206.8352,1229.184]
[163,53,0.75,0.79500000000000004,0.81,0.82499999999999996,1126.44,1194.0264,1216.5551999999998,1239.0839999999998]
[164,54,0.75,0.79500000000000004,0.81,0.82499999999999996,1135.44,1203.5663999999999,1226.2752,1248.9839999999999]
[165,55,0.75,0.79500000000000004,0.81,0.82499999999999996,1144.44,1213.1064000000001,1235.9951999999998,1258.884]
[166,56,0.75,0.79500000000000004,0.81,0.82499999999999996,1153.44,1222.6464000000001,1245.7151999999999,1268.7840000000001]
[167,57,0.75,0.79500000000000004,0.81,0.82499999999999996,1162.44,1232.1864,1255.4351999999999,1278.684]
[168,58,0.75,0.79500000000000004,0.81,0.82499999999999996,1171.44,1241.7264,1265.1551999999999,1288.5839999999998]
[169,59,0.75,0.79500000000000004,0.81,0.82499999999999996,1180.44,1251.2664,1274.8751999999999,1298.4839999999999]
[170,60,0.75,0.79500000000000004,0.81,0.82499999999999996,1189.44,1260.8063999999999,1284.5952,1308.384]
[171,61,0.75,0.79500000000000004,0.81,0.82499999999999996,1198.44,1270.3463999999999,1294.3152,1318.2840000000001]
[172,62,0.75,0.79500000000000004,0.81,0.82499999999999996,1207.44,1279.8863999999999,1304.0352,1328.184]
[173,63,0.75,0.79500000000000004,0.81,0.82499999999999996,1216.44,1289.4263999999998,1313.7552000000001,1338.0839999999998]
[174,64,0.75,0.79500000000000004,0.81,0.82499999999999996,1225.44,1298.9664,1323.4751999999999,1347.9839999999999]
[175,65,0.75,0.79500000000000004,0.81,0.82499999999999996,1234.44,1308.5064,1333.1952000000001,1357.884]
[176,66,0.75,0.79500000000000004,0.81,0.82499999999999996,{"$f":"G$119+$B185*C185*12","v":1243.44},1318.0464000000002,1342.9151999999999,1367.7840000000001]
[177,67,0.75,0.79500000000000004,0.81,0.82499999999999996,1252.44,1327.5864000000001,1352.6351999999999,1377.684]
[178,68,0.75,0.79500000000000004,0.81,0.82499999999999996,1261.44,1337.1264000000001,1362.3552,1387.5839999999998]
[179,69,0.75,0.79500000000000004,0.81,0.82499999999999996,1270.44,1346.6664000000001,1372.0752,1397.4839999999999]
[180,70,0.75,0.79500000000000004,0.81,0.82499999999999996,1279.44,1356.2064,1381.7952,1407.384]
[181,71,0.75,0.79500000000000004,0.81,0.82499999999999996,1288.44,1365.7464,1391.5152,1417.2840000000001]
[182,72,0.75,0.79500000000000004,0.81,0.82499999999999996,1297.44,1375.2864,1401.2352000000001,1427.184]
[183,73,0.75,0.79500000000000004,0.81,0.82499999999999996,1306.44,1384.8263999999999,1410.9551999999999,1437.0839999999998]
[184,74,0.75,0.79500000000000004,0.81,0.82499999999999996,1315.44,1394.3663999999999,1420.6752000000001,1446.9839999999999]
[185,75,0.75,0.79500000000000004,0.81,0.82499999999999996,1324.44,1403.9063999999998,1430.3951999999999,1456.884]
[186,76,0.75,0.79500000000000004,0.81,0.82499999999999996,1333.44,1413.4463999999998,1440.1152,1466.7840000000001]
[187,77,0.75,0.79500000000000004,0.81,0.82499999999999996,1342.44,1422.9864,1449.8352,1476.684]
[188,78,0.75,0.79500000000000004,0.81,0.82499999999999996,1351.44,1432.5264000000002,1459.5552,1486.5839999999998]
[189,79,0.75,0.79500000000000004,0.81,0.82499999999999996,1360.44,1442.0663999999999,1469.2752,1496.4839999999999]
[190,80,0.75,0.79500000000000004,0.81,0.82499999999999996,1369.44,1451.6064000000001,1478.9952000000001,1506.384]
[191,81,0.75,0.79500000000000004,0.81,0.82499999999999996,1378.44,{"$f":"H$119+$B200*D200*12","v":1461.1464000000001},{"$f":"I$119+$B200*E200*12","v":1488.7151999999999},{"$f":"J$119+$B200*F200*12","v":1516.2840000000001}]
[192,82,0.75,0.79500000000000004,0.81,0.82499999999999996,1387.44,1470.6864,1498.4351999999999,1526.184]
[193,83,0.75,0.79500000000000004,0.81,0.82499999999999996,1396.44,1480.2264,1508.1551999999999,1536.0839999999998]
[194,84,0.75,0.79500000000000004,0.81,0.82499999999999996,1405.44,1489.7664,1517.8751999999999,1545.9839999999999]
[195,85,0.75,0.79500000000000004,0.81,0.82499999999999996,1414.44,1499.3063999999999,1527.5952,1555.884]
[196,86,0.75,0.79500000000000004,0.81,0.82499999999999996,1423.44,1508.8463999999999,1537.3152,1565.7840000000001]
[197,87,0.75,0.79500000000000004,0.81,0.82499999999999996,1432.44,1518.3863999999999,1547.0351999999998,1575.684]
[198,88,0.75,0.79500000000000004,0.81,0.82499999999999996,1441.44,1527.9264000000001,1556.7552000000001,1585.5839999999998]
[199,89,0.75,0.79500000000000004,0.81,0.82499999999999996,1450.44,1537.4664000000002,1566.4751999999999,1595.4839999999999]
[200,90,0.75,0.79500000000000004,0.81,0.82499999999999996,1459.44,1547.0063999999998,1576.1952000000001,1605.384]
[201,91,0.75,0.79500000000000004,0.81,0.82499999999999996,1468.44,1556.5463999999999,1585.9151999999999,1615.2840000000001]
[202,92,0.75,0.79500000000000004,0.81,0.82499999999999996,1477.44,1566.0864000000001,1595.6352000000002,1625.184]
[203,93,0.75,0.79500000000000004,0.81,0.82499999999999996,1486.44,1575.6264000000001,1605.3552,1635.0839999999998]
[204,94,0.75,0.79500000000000004,0.81,0.82499999999999996,1495.44,1585.1664000000001,1615.0752,1644.9839999999999]
[205,95,0.75,0.79500000000000004,0.81,0.82499999999999996,1504.44,1594.7064,1624.7952,1654.884]
[206,96,0.75,0.79500000000000004,0.81,0.82499999999999996,1513.44,1604.2464,1634.5152,1664.7839999999999]
[207,97,0.75,0.79500000000000004,0.81,0.82499999999999996,1522.44,1613.7864,1644.2352000000001,1674.684]
[208,98,0.75,0.79500000000000004,0.81,0.82499999999999996,1531.44,1623.3263999999999,1653.9552000000001,1684.5839999999998]
[209,99,0.75,0.79500000000000004,0.81,0.82499999999999996,1540.44,1632.8663999999999,1663.6752000000001,1694.4839999999999]
[210,100,0.75,0.79500000000000004,0.81,0.82499999999999996,1549.44,1642.4063999999998,1673.3951999999999,1704.384]
[211,101,0.75,0.79500000000000004,0.81,0.82499999999999996,1558.44,1651.9463999999998,1683.1152,1714.2839999999999]
[212,102,0.75,0.79500000000000004,0.81,0.82499999999999996,1567.44,1661.4864,1692.8352,1724.184]
[213,103,0.75,0.79500000000000004,0.81,0.82499999999999996,1576.44,1671.0264000000002,1702.5552,1734.0839999999998]
[214,104,0.75,0.79500000000000004,0.81,0.82499999999999996,1585.44,1680.5664000000002,1712.2752,1743.9839999999999]
[215,105,0.75,0.79500000000000004,0.81,0.82499999999999996,1594.44,1690.1064000000001,1721.9952000000001,1753.884]
[216,106,0.75,0.79500000000000004,0.81,0.82499999999999996,1603.44,1699.6464000000001,1731.7151999999999,1763.7839999999999]
[217,107,0.75,0.79500000000000004,0.81,0.82499999999999996,1612.44,1709.1864,1741.4351999999999,1773.684]
[218,108,0.75,0.79500000000000004,0.81,0.82499999999999996,1621.44,1718.7264,1751.1551999999999,1783.5839999999998]
[219,109,0.75,0.79500000000000004,0.81,0.82499999999999996,1630.44,1728.2664,1760.8751999999999,1793.4839999999999]
[220,110,0.75,0.79500000000000004,0.81,0.82499999999999996,1639.44,1737.8063999999999,1770.5952,1803.384]
[221,111,0.75,0.79500000000000004,0.81,0.82499999999999996,1648.44,1747.3463999999999,1780.3152,1813.2839999999999]
[222,112,0.75,0.79500000000000004,0.81,0.82499999999999996,1657.44,1756.8863999999999,1790.0351999999998,1823.184]
[223,113,0.75,0.79500000000000004,0.81,0.82499999999999996,1666.44,1766.4263999999998,1799.7552000000001,1833.0839999999998]
[224,114,0.75,0.79500000000000004,0.81,0.82499999999999996,1675.44,1775.9664000000002,1809.4751999999999,1842.9839999999999]
[225,115,0.75,0.79500000000000004,0.81,0.82499999999999996,1684.44,1785.5064000000002,1819.1952000000001,1852.884]
[226,116,0.75,0.79500000000000004,0.81,0.82499999999999996,1693.44,1795.0463999999997,1828.9151999999999,1862.7839999999999]
[227,117,0.75,0.79500000000000004,0.81,0.82499999999999996,1702.44,1804.5864000000001,1838.6352000000002,1872.684]
[228,118,0.75,0.79500000000000004,0.81,0.82499999999999996,1711.44,1814.1264000000001,1848.3552,1882.5839999999998]
[229,119,0.75,0.79500000000000004,0.81,0.82499999999999996,1720.44,1823.6664000000001,1858.0752,1892.4839999999999]
[230,120,0.75,0.79500000000000004,0.81,0.82499999999999996,1729.44,1833.2064,1867.7952,1902.384]
[231,121,0.75,0.79500000000000004,0.81,0.82499999999999996,1738.44,1842.7464,1877.5152,1912.2839999999999]
[232,122,0.75,0.79500000000000004,0.81,0.82499999999999996,1747.44,1852.2864,1887.2352000000001,1922.184]
[233,123,0.75,0.79500000000000004,0.81,0.82499999999999996,1756.44,1861.8263999999999,1896.9552000000001,1932.0839999999998]
[234,124,0.75,0.79500000000000004,0.81,0.82499999999999996,1765.44,1871.3663999999999,1906.6752000000001,1941.9839999999999]
[235,125,0.75,0.79500000000000004,0.81,0.82499999999999996,1774.44,1880.9063999999998,1916.3951999999999,1951.884]
[236,126,0.75,0.79500000000000004,0.81,0.82499999999999996,1783.44,1890.4463999999998,1926.1152,1961.7839999999999]
[237,127,0.75,0.79500000000000004,0.81,0.82499999999999996,1792.44,1899.9863999999998,1935.8352,1971.684]
[238,128,0.75,0.79500000000000004,0.81,0.82499999999999996,1801.44,1909.5264000000002,1945.5552,1981.5839999999998]
[239,129,0.75,0.79500000000000004,0.81,0.82499999999999996,1810.44,1919.0664000000002,1955.2752,1991.4839999999999]
[240,130,0.75,0.79500000000000004,0.81,0.82499999999999996,{"$f":"G$119+$B249*C249*12","v":1819.44},1928.6064000000001,1964.9952000000001,2001.384]
[241,131,0.75,0.79500000000000004,0.81,0.82499999999999996,1828.44,1938.1464000000001,1974.7152000000001,2011.2839999999999]
[242,132,0.75,0.79500000000000004,0.81,0.82499999999999996,1837.44,1947.6864,1984.4351999999999,2021.184]
[243,133,0.75,0.79500000000000004,0.81,0.82499999999999996,1846.44,1957.2264,1994.1551999999999,2031.0839999999998]
[244,134,0.75,0.79500000000000004,0.81,0.82499999999999996,1855.44,1966.7664,2003.8751999999999,2040.9839999999999]
[245,135,0.75,0.79500000000000004,0.81,0.82499999999999996,1864.44,1976.3063999999999,2013.5952,2050.884]
[246,136,0.75,0.79500000000000004,0.81,0.82499999999999996,1873.44,1985.8463999999999,2023.3152,2060.7839999999997]
[247,137,0.75,0.79500000000000004,0.81,0.82499999999999996,1882.44,1995.3863999999999,2033.0352,2070.6840000000002]
[248,138,0.75,0.79500000000000004,0.81,0.82499999999999996,1891.44,2004.9263999999998,2042.7552000000001,2080.5839999999998]
[249,139,0.75,0.79500000000000004,0.81,0.82499999999999996,1900.44,2014.4664000000002,2052.4751999999999,2090.4839999999999]
[250,140,0.75,0.79500000000000004,0.81,0.82499999999999996,1909.44,2024.0064000000002,2062.1952000000001,2100.384]
[251,141,0.75,0.79500000000000004,0.81,0.82499999999999996,1918.44,2033.5463999999997,2071.9151999999999,2110.2839999999997]
[252,142,0.75,0.79500000000000004,0.81,0.82499999999999996,1927.44,2043.0864000000001,2081.6352000000002,2120.1840000000002]
[253,143,0.75,0.79500000000000004,0.81,0.82499999999999996,1936.44,2052.6264000000001,2091.3552,2130.0839999999998]
[254,144,0.75,0.79500000000000004,0.81,0.82499999999999996,1945.44,2062.1664000000001,2101.0752000000002,2139.9839999999999]
[255,145,0.75,0.79500000000000004,0.81,0.82499999999999996,1954.44,{"$f":"H$119+$B264*D264*12","v":2071.7064},{"$f":"I$119+$B264*E264*12","v":2110.7952},{"$f":"J$119+$B264*F264*12","v":2149.884}]
[256,146,0.75,0.79500000000000004,0.81,0.82499999999999996,1963.44,2081.2464,2120.5151999999998,2159.7839999999997]
[257,147,0.75,0.79500000000000004,0.81,0.82499999999999996,1972.44,2090.7864,2130.2352000000001,2169.6840000000002]
[258,148,0.75,0.79500000000000004,0.81,0.82499999999999996,1981.44,2100.3263999999999,2139.9552000000003,2179.5839999999998]
[259,149,0.75,0.79500000000000004,0.81,0.82499999999999996,1990.44,2109.8663999999999,2149.6752000000001,2189.4839999999999]
[260,150,0.75,0.79500000000000004,0.81,0.82499999999999996,1999.44,2119.4063999999998,2159.3951999999999,2199.384]
[261,151,0.75,0.79500000000000004,0.81,0.82499999999999996,2008.44,2128.9463999999998,2169.1152000000002,2209.2839999999997]
[262,152,0.75,0.79500000000000004,0.81,0.82499999999999996,2017.44,2138.4863999999998,2178.8352,2219.1840000000002]
[263,153,0.75,0.79500000000000004,0.81,0.82499999999999996,2026.44,2148.0264000000002,2188.5551999999998,2229.0839999999998]
[264,154,0.75,0.79500000000000004,0.81,0.82499999999999996,2035.44,2157.5664000000002,2198.2752,2238.9839999999999]
[265,155,0.75,0.79500000000000004,0.81,0.82499999999999996,2044.44,2167.1064000000001,2207.9952000000003,2248.884]
[266,156,0.75,0.79500000000000004,0.81,0.82499999999999996,2053.44,2176.6464000000001,2217.7152000000001,2258.7839999999997]
[267,157,0.75,0.79500000000000004,0.81,0.82499999999999996,2062.44,2186.1864,2227.4351999999999,2268.6840000000002]
[268,158,0.75,0.79500000000000004,0.81,0.82499999999999996,2071.44,2195.7264,2237.1552000000001,2278.5839999999998]
[269,159,0.75,0.79500000000000004,0.81,0.82499999999999996,2080.44,2205.2664,2246.8752000000004,2288.4839999999999]
[270,160,0.75,0.79500000000000004,0.81,0.82499999999999996,2089.44,2214.8063999999999,2256.5952000000002,2298.384]
[271,161,0.75,0.79500000000000004,0.81,0.82499999999999996,2098.44,2224.3463999999999,2266.3152,2308.2839999999997]
[272,162,0.75,0.79500000000000004,0.81,0.82499999999999996,2107.44,2233.8864000000003,2276.0351999999998,2318.1840000000002]
[273,163,0.75,0.79500000000000004,0.81,0.82499999999999996,2116.44,2243.4263999999998,2285.7552000000001,2328.0839999999998]
[274,164,0.75,0.79500000000000004,0.81,0.82499999999999996,2125.44,2252.9663999999998,2295.4751999999999,2337.9839999999999]
[275,165,0.75,0.79500000000000004,0.81,0.82499999999999996,2134.44,2262.5064000000002,2305.1952000000001,2347.884]
[276,166,0.75,0.79500000000000004,0.81,0.82499999999999996,2143.44,2272.0463999999997,2314.9151999999999,2357.7839999999997]
[277,167,0.75,0.79500000000000004,0.81,0.82499999999999996,2152.44,2281.5864000000001,2324.6352000000002,2367.6840000000002]
[278,168,0.75,0.79500000000000004,0.81,0.82499999999999996,2161.44,2291.1264000000001,2334.3552,2377.5839999999998]
[279,169,0.75,0.79500000000000004,0.81,0.82499999999999996,2170.44,2300.6664000000001,2344.0752000000002,2387.4839999999999]
[280,170,0.75,0.79500000000000004,0.81,0.82499999999999996,2179.44,2310.2064,2353.7952,2397.384]
[281,171,0.75,0.79500000000000004,0.81,0.82499999999999996,2188.44,2319.7464,2363.5152000000003,2407.2839999999997]
[282,172,0.75,0.79500000000000004,0.81,0.82499999999999996,2197.44,2329.2864,2373.2352000000001,2417.1840000000002]
[283,173,0.75,0.79500000000000004,0.81,0.82499999999999996,2206.44,2338.8263999999999,2382.9551999999999,2427.0839999999998]
[284,174,0.75,0.79500000000000004,0.81,0.82499999999999996,2215.44,2348.3663999999999,2392.6751999999997,2436.9839999999999]
[285,175,0.75,0.79500000000000004,0.81,0.82499999999999996,2224.44,2357.9063999999998,2402.3951999999999,2446.884]
[286,176,0.75,0.79500000000000004,0.81,0.82499999999999996,2233.44,2367.4464000000003,2412.1152000000002,2456.7839999999997]
[287,177,0.75,0.79500000000000004,0.81,0.82499999999999996,2242.44,2376.9863999999998,2421.8352,2466.6840000000002]
[288,178,0.75,0.79500000000000004,0.81,0.82499999999999996,2251.44,2386.5264000000002,2431.5551999999998,2476.5839999999998]
[289,179,0.75,0.79500000000000004,0.81,0.82499999999999996,2260.44,2396.0664000000002,2441.2752,2486.4839999999999]
[290,180,0.75,0.79500000000000004,0.81,0.82499999999999996,2269.44,2405.6063999999997,2450.9952000000003,2496.384]
[291,181,0.75,0.79500000000000004,0.81,0.82499999999999996,2278.44,2415.1464000000001,2460.7152000000001,2506.2839999999997]
[292,182,0.75,0.79500000000000004,0.81,0.82499999999999996,2287.44,2424.6864,2470.4351999999999,2516.1840000000002]
[293,183,0.75,0.79500000000000004,0.81,0.82499999999999996,2296.44,2434.2264,2480.1552000000001,2526.0839999999998]
[294,184,0.75,0.79500000000000004,0.81,0.82499999999999996,2305.44,2443.7664,2489.8752000000004,2535.9839999999999]
[295,185,0.75,0.79500000000000004,0.81,0.82499999999999996,2314.44,2453.3063999999999,2499.5952000000002,2545.884]
[296,186,0.75,0.79500000000000004,0.81,0.82499999999999996,2323.44,2462.8463999999999,2509.3152,2555.7839999999997]
[297,187,0.75,0.79500000000000004,0.81,0.82499999999999996,2332.44,2472.3864000000003,2519.0351999999998,2565.6840000000002]
[298,188,0.75,0.79500000000000004,0.81,0.82499999999999996,2341.44,2481.9263999999998,2528.7552000000001,2575.5839999999998]
[299,189,0.75,0.79500000000000004,0.81,0.82499999999999996,2350.44,2491.4663999999998,2538.4751999999999,2585.4839999999999]
[300,190,0.75,0.79500000000000004,0.81,0.82499999999999996,2359.44,2501.0064000000002,2548.1952000000001,2595.384]
[301,191,0.75,0.79500000000000004,0.81,0.82499999999999996,2368.44,2510.5463999999997,2557.9151999999999,2605.2839999999997]
[302,192,0.75,0.79500000000000004,0.81,0.82499999999999996,2377.44,2520.0864000000001,2567.6352000000002,2615.1839999999997]
[303,193,0.75,0.79500000000000004,0.81,0.82499999999999996,2386.44,2529.6264000000001,2577.3552,2625.0839999999998]
[304,194,0.75,0.79500000000000004,0.81,0.82499999999999996,{"$f":"G$119+$B313*C313*12","v":2395.44},2539.1664000000001,2587.0752000000002,2634.9839999999999]
[305,195,0.75,0.79500000000000004,0.81,0.82499999999999996,2404.44,2548.7064,2596.7952,2644.884]
[306,196,0.75,0.79500000000000004,0.81,0.82499999999999996,2413.44,2558.2464,2606.5152000000003,2654.7839999999997]
[307,197,0.75,0.79500000000000004,0.81,0.82499999999999996,2422.44,2567.7864,2616.2352000000001,2664.6839999999997]
[308,198,0.75,0.79500000000000004,0.81,0.82499999999999996,2431.44,2577.3263999999999,2625.9552000000003,2674.5839999999998]
[309,199,0.75,0.79500000000000004,0.81,0.82499999999999996,2440.44,2586.8663999999999,2635.6751999999997,2684.4839999999999]
[310,200,0.75,0.79500000000000004,0.81,0.82499999999999996,2449.44,2596.4063999999998,2645.3951999999999,2694.384]
[311,201,0.75,0.79500000000000004,0.81,0.82499999999999996,2458.44,2605.9464000000003,2655.1152000000002,2704.2839999999997]
[312,202,0.75,0.79500000000000004,0.81,0.82499999999999996,2467.44,2615.4863999999998,2664.8352,2714.1839999999997]
[313,203,0.75,0.79500000000000004,0.81,0.82499999999999996,2476.44,2625.0264000000002,2674.5551999999998,2724.0839999999998]
[314,204,0.75,0.79500000000000004,0.81,0.82499999999999996,2485.44,2634.5664000000002,2684.2752,2733.9839999999999]
[315,205,0.75,0.79500000000000004,0.81,0.82499999999999996,2494.44,2644.1063999999997,2693.9952000000003,2743.884]
[316,206,0.75,0.79500000000000004,0.81,0.82499999999999996,2503.44,2653.6464000000001,2703.7152000000001,2753.7839999999997]
[317,207,0.75,0.79500000000000004,0.81,0.82499999999999996,2512.44,2663.1864,2713.4351999999999,2763.6839999999997]
[318,208,0.75,0.79500000000000004,0.81,0.82499999999999996,2521.44,2672.7264,2723.1552000000001,2773.5839999999998]
[319,209,0.75,0.79500000000000004,0.81,0.82499999999999996,2530.44,{"$f":"H$119+$B328*D328*12","v":2682.2664},{"$f":"I$119+$B328*E328*12","v":2732.8752000000004},{"$f":"J$119+$B328*F328*12","v":2783.4839999999999}]
[320,210,0.75,0.79500000000000004,0.81,0.82499999999999996,2539.44,2691.8063999999999,2742.5952000000002,2793.384]
[321,211,0.75,0.79500000000000004,0.81,0.82499999999999996,2548.44,2701.3463999999999,2752.3152,2803.2839999999997]
[322,212,0.75,0.79500000000000004,0.81,0.82499999999999996,2557.44,2710.8864000000003,2762.0351999999998,2813.1839999999997]
[323,213,0.75,0.79500000000000004,0.81,0.82499999999999996,2566.44,2720.4263999999998,2771.7552000000001,2823.0839999999998]
[324,214,0.75,0.79500000000000004,0.81,0.82499999999999996,2575.44,2729.9663999999998,2781.4751999999999,2832.9839999999999]
[325,215,0.75,0.79500000000000004,0.81,0.82499999999999996,2584.44,2739.5064000000002,2791.1952000000001,2842.884]
[326,216,0.75,0.79500000000000004,0.81,0.82499999999999996,2593.44,2749.0463999999997,2800.9151999999999,2852.7839999999997]
[327,217,0.75,0.79500000000000004,0.81,0.82499999999999996,2602.44,2758.5864000000001,2810.6352000000002,2862.6839999999997]
[328,218,0.75,0.79500000000000004,0.81,0.82499999999999996,2611.44,2768.1264000000001,2820.3552,2872.5839999999998]
[329,219,0.75,0.79500000000000004,0.81,0.82499999999999996,2620.44,2777.6664000000001,2830.0752000000002,2882.4839999999999]
[330,220,0.75,0.79500000000000004,0.81,0.82499999999999996,2629.44,2787.2064,2839.7952,2892.384]
[331,221,0.75,0.79500000000000004,0.81,0.82499999999999996,2638.44,2796.7464,2849.5152000000003,2902.2839999999997]
[332,222,0.75,0.79500000000000004,0.81,0.82499999999999996,2647.44,2806.2864,2859.2352000000001,2912.1839999999997]
[333,223,0.75,0.79500000000000004,0.81,0.82499999999999996,2656.44,2815.8263999999999,2868.9552000000003,2922.0839999999998]
[334,224,0.75,0.79500000000000004,0.81,0.82499999999999996,2665.44,2825.3663999999999,2878.6751999999997,2931.9839999999999]
[335,225,0.75,0.79500000000000004,0.81,0.82499999999999996,2674.44,2834.9063999999998,2888.3951999999999,2941.884]
[336,226,0.75,0.79500000000000004,0.81,0.82499999999999996,2683.44,2844.4463999999998,2898.1152000000002,2951.7839999999997]
[337,227,0.75,0.79500000000000004,0.81,0.82499999999999996,2692.44,2853.9863999999998,2907.8352,2961.6839999999997]
[338,228,0.75,0.79500000000000004,0.81,0.82499999999999996,2701.44,2863.5264000000002,2917.5551999999998,2971.5839999999998]
[339,229,0.75,0.79500000000000004,0.81,0.82499999999999996,2710.44,2873.0663999999997,2927.2752,2981.4839999999999]
[340,230,0.75,0.79500000000000004,0.81,0.82499999999999996,2719.44,2882.6064000000001,2936.9952000000003,2991.384]
[341,231,0.75,0.79500000000000004,0.81,0.82499999999999996,2728.44,2892.1464000000001,2946.7152000000001,3001.2839999999997]
[342,232,0.75,0.79500000000000004,0.81,0.82499999999999996,2737.44,2901.6863999999996,2956.4351999999999,3011.1839999999997]
[343,233,0.75,0.79500000000000004,0.81,0.82499999999999996,2746.44,2911.2264,2966.1552000000001,3021.0839999999998]
[344,234,0.75,0.79500000000000004,0.81,0.82499999999999996,2755.44,2920.7664,2975.8752000000004,3030.9839999999999]
[345,235,0.75,0.79500000000000004,0.81,0.82499999999999996,2764.44,2930.3063999999999,2985.5952000000002,3040.884]
[346,236,0.75,0.79500000000000004,0.81,0.82499999999999996,2773.44,2939.8463999999999,2995.3152,3050.7839999999997]
[347,237,0.75,0.79500000000000004,0.81,0.82499999999999996,2782.44,2949.3864000000003,3005.0351999999998,3060.6839999999997]
[348,238,0.75,0.79500000000000004,0.81,0.82499999999999996,2791.44,2958.9263999999998,3014.7552000000001,3070.5839999999998]
[349,239,0.75,0.79500000000000004,0.81,0.82499999999999996,2800.44,2968.4663999999998,3024.4751999999999,3080.4839999999999]
[350,240,0.75,0.79500000000000004,0.81,0.82499999999999996,2809.44,2978.0064000000002,3034.1952000000001,3090.384]
[351,241,0.75,0.79500000000000004,0.81,0.82499999999999996,2818.44,2987.5463999999997,3043.9151999999999,3100.2839999999997]
[352,242,0.75,0.79500000000000004,0.81,0.82499999999999996,2827.44,2997.0864000000001,3053.6352000000002,3110.1839999999997]
[353,243,0.75,0.79500000000000004,0.81,0.82499999999999996,2836.44,3006.6264000000001,3063.3552,3120.0839999999998]
[354,244,0.75,0.79500000000000004,0.81,0.82499999999999996,2845.44,3016.1664000000001,3073.0752000000002,3129.9839999999999]
[355,245,0.75,0.79500000000000004,0.81,0.82499999999999996,2854.44,3025.7064,3082.7952,3139.884]
[356,246,0.75,0.79500000000000004,0.81,0.82499999999999996,2863.44,3035.2464,3092.5152000000003,3149.7839999999997]
[357,247,0.75,0.79500000000000004,0.81,0.82499999999999996,2872.44,3044.7864,3102.2352000000001,3159.6839999999997]
[358,248,0.75,0.79500000000000004,0.81,0.82499999999999996,2881.44,3054.3263999999999,3111.9552000000003,3169.5839999999998]
[359,249,0.75,0.79500000000000004,0.81,0.82499999999999996,2890.44,3063.8663999999999,3121.6752000000001,3179.4839999999999]
[360,250,0.75,0.79500000000000004,0.81,0.82499999999999996,2899.44,3073.4063999999998,3131.3951999999999,3189.384]
[361,251,0.75,0.79500000000000004,0.81,0.82499999999999996,2908.44,3082.9463999999998,3141.1152000000002,3199.2839999999997]
[362,252,0.75,0.79500000000000004,0.81,0.82499999999999996,2917.44,3092.4863999999998,3150.8352,3209.1839999999997]
[363,253,0.75,0.79500000000000004,0.81,0.82499999999999996,2926.44,3102.0264000000002,3160.5551999999998,3219.0839999999998]
[364,254,0.75,0.79500000000000004,0.81,0.82499999999999996,2935.44,3111.5663999999997,3170.2752,3228.9839999999999]
[365,255,0.75,0.79500000000000004,0.81,0.82499999999999996,2944.44,3121.1064000000001,3179.9952000000003,3238.884]
[366,256,0.75,0.79500000000000004,0.81,0.82499999999999996,2953.44,3130.6464000000001,3189.7152000000001,3248.7839999999997]
[367,257,0.75,0.79500000000000004,0.81,0.82499999999999996,2962.44,3140.1863999999996,3199.4351999999999,3258.6839999999997]
[368,258,0.75,0.79500000000000004,0.81,0.82499999999999996,{"$f":"G$119+$B377*C377*12","v":2971.44},3149.7264,3209.1552000000001,3268.5839999999998]
[369,259,0.75,0.79500000000000004,0.81,0.82499999999999996,2980.44,3159.2664,3218.8752000000004,3278.4839999999999]
[370,260,0.75,0.79500000000000004,0.81,0.82499999999999996,2989.44,3168.8063999999999,3228.5952000000002,3288.384]
[371,261,0.75,0.79500000000000004,0.81,0.82499999999999996,2998.44,3178.3463999999999,3238.3152,3298.2839999999997]
[372,262,0.75,0.79500000000000004,0.81,0.82499999999999996,3007.44,3187.8864000000003,3248.0352000000003,3308.1839999999997]
[373,263,0.75,0.79500000000000004,0.81,0.82499999999999996,3016.44,3197.4263999999998,3257.7552000000001,3318.0839999999998]
[374,264,0.75,0.79500000000000004,0.81,0.82499999999999996,3025.44,3206.9664000000002,3267.4751999999999,3327.9839999999999]
[375,265,0.75,0.79500000000000004,0.81,0.82499999999999996,3034.44,3216.5064000000002,3277.1952000000001,3337.884]
[376,266,0.75,0.79500000000000004,0.81,0.82499999999999996,3043.44,3226.0463999999997,3286.9151999999999,3347.7839999999997]
[377,267,0.75,0.79500000000000004,0.81,0.82499999999999996,3052.44,3235.5864000000001,3296.6352000000002,3357.6839999999997]
[378,268,0.75,0.79500000000000004,0.81,0.82499999999999996,3061.44,3245.1264000000001,3306.3552,3367.5839999999998]
[379,269,0.75,0.79500000000000004,0.81,0.82499999999999996,3070.44,3254.6664000000001,3316.0752000000002,3377.4839999999999]
[380,270,0.75,0.79500000000000004,0.81,0.82499999999999996,3079.44,3264.2064,3325.7952,3387.384]
[381,271,0.75,0.79500000000000004,0.81,0.82499999999999996,3088.44,3273.7464,3335.5152000000003,3397.2839999999997]
[382,272,0.75,0.79500000000000004,0.81,0.82499999999999996,3097.44,3283.2864,3345.2352000000001,3407.1839999999997]
[383,273,0.75,0.79500000000000004,0.81,0.82499999999999996,3106.44,{"$f":"H$119+$B392*D392*12","v":3292.8263999999999},{"$f":"I$119+$B392*E392*12","v":3354.9552000000003},{"$f":"J$119+$B392*F392*12","v":3417.0839999999998}]
[384,274,0.75,0.79500000000000004,0.81,0.82499999999999996,3115.44,3302.3663999999999,3364.6752000000001,3426.9839999999999]
[385,275,0.75,0.79500000000000004,0.81,0.82499999999999996,3124.44,3311.9063999999998,3374.3952000000004,3436.884]
[386,276,0.75,0.79500000000000004,0.81,0.82499999999999996,3133.44,3321.4463999999998,3384.1152000000002,3446.7839999999997]
[387,277,0.75,0.79500000000000004,0.81,0.82499999999999996,3142.44,3330.9863999999998,3393.8352,3456.6839999999997]
[388,278,0.75,0.79500000000000004,0.81,0.82499999999999996,3151.44,3340.5264000000002,3403.5551999999998,3466.5839999999998]
[389,279,0.75,0.79500000000000004,0.81,0.82499999999999996,3160.44,3350.0663999999997,3413.2752,3476.4839999999999]
[390,280,0.75,0.79500000000000004,0.81,0.82499999999999996,3169.44,3359.6064000000001,3422.9952000000003,3486.384]
[391,281,0.75,0.79500000000000004,0.81,0.82499999999999996,3178.44,3369.1464000000001,3432.7152000000001,3496.2839999999997]
[392,282,0.75,0.79500000000000004,0.81,0.82499999999999996,3187.44,3378.6863999999996,3442.4351999999999,3506.1839999999997]
[393,283,0.75,0.79500000000000004,0.81,0.82499999999999996,3196.44,3388.2264,3452.1552000000001,3516.0839999999998]
[394,284,0.75,0.79500000000000004,0.81,0.82499999999999996,3205.44,3397.7664,3461.8752000000004,3525.9839999999999]
[395,285,0.75,0.79500000000000004,0.81,0.82499999999999996,3214.44,3407.3063999999999,3471.5952000000002,3535.884]
[396,286,0.75,0.79500000000000004,0.81,0.82499999999999996,3223.44,3416.8463999999999,3481.3152,3545.7839999999997]
[397,287,0.75,0.79500000000000004,0.81,0.82499999999999996,3232.44,3426.3864000000003,3491.0352000000003,3555.6839999999997]
[398,288,0.75,0.79500000000000004,0.81,0.82499999999999996,3241.44,3435.9263999999998,3500.7552000000005,3565.5839999999998]
[399,289,0.75,0.79500000000000004,0.81,0.82499999999999996,3250.44,3445.4664000000002,3510.4751999999999,3575.4839999999999]
[400,290,0.75,0.79500000000000004,0.81,0.82499999999999996,3259.44,3455.0064000000002,3520.1952000000001,3585.384]
[401,291,0.75,0.79500000000000004,0.81,0.82499999999999996,3268.44,3464.5463999999997,3529.9151999999999,3595.2839999999997]
[402,292,0.75,0.79500000000000004,0.81,0.82499999999999996,3277.44,3474.0864000000001,3539.6352000000002,3605.1839999999997]
[403,293,0.75,0.79500000000000004,0.81,0.82499999999999996,3286.44,3483.6264000000001,3549.3552,3615.0839999999998]
[404,294,0.75,0.79500000000000004,0.81,0.82499999999999996,3295.44,3493.1664000000001,3559.0752000000002,3624.9839999999999]
[405,295,0.75,0.79500000000000004,0.81,0.82499999999999996,3304.44,3502.7064,3568.7952,3634.884]
[406,296,0.75,0.79500000000000004,0.81,0.82499999999999996,3313.44,3512.2464,3578.5152000000003,3644.7839999999997]
[407,297,0.75,0.79500000000000004,0.81,0.82499999999999996,3322.44,3521.7864,3588.2352000000001,3654.6839999999997]
[408,298,0.75,0.79500000000000004,0.81,0.82499999999999996,3331.44,3531.3263999999999,3597.9552000000003,3664.5839999999998]
[409,299,0.75,0.79500000000000004,0.81,0.82499999999999996,3340.44,3540.8663999999999,3607.6752000000001,3674.4839999999999]
[410,300,0.75,0.79500000000000004,0.81,0.82499999999999996,3349.44,3550.4063999999998,3617.3952000000004,3684.384]
[411,301,0.75,0.79500000000000004,0.81,0.82499999999999996,3358.44,3559.9463999999998,3627.1152000000002,3694.2839999999997]
[412,302,0.75,0.79500000000000004,0.81,0.82499999999999996,3367.44,3569.4863999999998,3636.8352,3704.1839999999997]
[413,303,0.75,0.79500000000000004,0.81,0.82499999999999996,3376.44,3579.0264000000002,3646.5551999999998,3714.0839999999998]
[414,304,0.75,0.79500000000000004,0.81,0.82499999999999996,3385.44,3588.5663999999997,3656.2752,3723.9839999999999]
[415,305,0.75,0.79500000000000004,0.81,0.82499999999999996,3394.44,3598.1064000000001,3665.9952000000003,3733.884]
[416,306,0.75,0.79500000000000004,0.81,0.82499999999999996,3403.44,3607.6464000000001,3675.7152000000001,3743.7839999999997]
[417,307,0.75,0.79500000000000004,0.81,0.82499999999999996,3412.44,3617.1864,3685.4351999999999,3753.6839999999997]
[418,308,0.75,0.79500000000000004,0.81,0.82499999999999996,3421.44,3626.7264,3695.1552000000001,3763.5839999999998]
[419,309,0.75,0.79500000000000004,0.81,0.82499999999999996,3430.44,3636.2664,3704.8752000000004,3773.4839999999999]
[420,310,0.75,0.79500000000000004,0.81,0.82499999999999996,3439.44,3645.8063999999999,3714.5952000000002,3783.384]
[421,311,0.75,0.79500000000000004,0.81,0.82499999999999996,3448.44,3655.3463999999999,3724.3152,3793.2839999999997]
[422,312,0.75,0.79500000000000004,0.81,0.82499999999999996,3457.44,3664.8864000000003,3734.0352000000003,3803.1839999999997]
[423,313,0.75,0.79500000000000004,0.81,0.82499999999999996,3466.44,3674.4263999999998,3743.7552000000005,3813.0839999999998]
[424,314,0.75,0.79500000000000004,0.81,0.82499999999999996,3475.44,3683.9664000000002,3753.4751999999999,3822.9840000000004]
[425,315,0.75,0.79500000000000004,0.81,0.82499999999999996,3484.44,3693.5064000000002,3763.1952000000001,3832.884]
[426,316,0.75,0.79500000000000004,0.81,0.82499999999999996,3493.44,3703.0463999999997,3772.9151999999999,3842.7839999999997]
[427,317,0.75,0.79500000000000004,0.81,0.82499999999999996,3502.44,3712.5864000000001,3782.6352000000006,3852.6839999999997]
[428,318,0.75,0.79500000000000004,0.81,0.82499999999999996,3511.44,3722.1264000000001,3792.3552000000004,3862.5839999999998]
[429,319,0.75,0.79500000000000004,0.81,0.82499999999999996,3520.44,3731.6664000000001,3802.0752000000002,3872.4840000000004]
[430,320,0.75,0.79500000000000004,0.81,0.82499999999999996,3529.44,3741.2064,3811.7952000000005,3882.384]
[431,321,0.75,0.79500000000000004,0.81,0.82499999999999996,3538.44,3750.7464,3821.5151999999998,3892.2839999999997]
[432,322,0.75,0.79500000000000004,0.81,0.82499999999999996,{"$f":"G$119+$B441*C441*12","v":3547.44},3760.2864,3831.2352000000001,3902.1839999999997]
[433,323,0.75,0.79500000000000004,0.81,0.82499999999999996,3556.44,3769.8263999999999,3840.9551999999999,3912.0839999999998]
[434,324,0.75,0.79500000000000004,0.81,0.82499999999999996,3565.44,3779.3664000000003,3850.6751999999997,3921.9840000000004]
[435,325,0.75,0.79500000000000004,0.81,0.82499999999999996,3574.44,3788.9063999999998,3860.3951999999999,3931.884]
[436,326,0.75,0.79500000000000004,0.81,0.82499999999999996,3583.44,3798.4463999999998,3870.1152000000002,3941.7839999999997]
[437,327,0.75,0.79500000000000004,0.81,0.82499999999999996,3592.44,3807.9864000000002,3879.8352,3951.6839999999997]
[438,328,0.75,0.79500000000000004,0.81,0.82499999999999996,3601.44,3817.5263999999997,3889.5551999999998,3961.5839999999998]
[439,329,0.75,0.79500000000000004,0.81,0.82499999999999996,3610.44,3827.0663999999997,3899.2752,3971.4840000000004]
[440,330,0.75,0.79500000000000004,0.81,0.82499999999999996,3619.44,3836.6064000000001,3908.9952000000003,3981.384]
[441,331,0.75,0.79500000000000004,0.81,0.82499999999999996,3628.44,3846.1464000000005,3918.7152000000001,3991.2839999999997]
[442,332,0.75,0.79500000000000004,0.81,0.82499999999999996,3637.44,3855.6863999999996,3928.4351999999999,4001.1839999999997]
[443,333,0.75,0.79500000000000004,0.81,0.82499999999999996,3646.44,3865.2264,3938.1552000000001,4011.0839999999998]
[444,334,0.75,0.79500000000000004,0.81,0.82499999999999996,3655.44,3874.7664000000004,3947.8752000000004,4020.9840000000004]
[445,335,0.75,0.79500000000000004,0.81,0.82499999999999996,3664.44,3884.3063999999995,3957.5952000000002,4030.884]
[446,336,0.75,0.79500000000000004,0.81,0.82499999999999996,3673.44,3893.8463999999999,3967.3152,4040.7839999999997]
[447,337,0.75,0.79500000000000004,0.81,0.82499999999999996,3682.44,{"$f":"H$119+$B456*D456*12","v":3903.3864000000003},{"$f":"I$119+$B456*E456*12","v":3977.0352000000003},{"$f":"J$119+$B456*F456*12","v":4050.6839999999997}]
[448,338,0.75,0.79500000000000004,0.81,0.82499999999999996,3691.44,3912.9264000000003,3986.7552000000005,4060.5839999999998]
[449,339,0.75,0.79500000000000004,0.81,0.82499999999999996,3700.44,3922.4663999999998,3996.4752000000003,4070.4840000000004]
[450,340,0.75,0.79500000000000004,0.81,0.82499999999999996,3709.44,3932.0064000000002,4006.1952000000001,4080.384]
[451,341,0.75,0.79500000000000004,0.81,0.82499999999999996,3718.44,3941.5464000000002,4015.9152000000004,4090.2839999999997]
[452,342,0.75,0.79500000000000004,0.81,0.82499999999999996,3727.44,3951.0863999999997,4025.6352000000006,4100.1839999999993]
[453,343,0.75,0.79500000000000004,0.81,0.82499999999999996,3736.44,3960.6264000000001,4035.3552000000004,4110.0839999999998]
[454,344,0.75,0.79500000000000004,0.81,0.82499999999999996,3745.44,3970.1664000000001,4045.0752000000002,4119.9840000000004]
[455,345,0.75,0.79500000000000004,0.81,0.82499999999999996,3754.44,3979.7064,4054.7952000000005,4129.884]
[456,346,0.75,0.79500000000000004,0.81,0.82499999999999996,3763.44,3989.2464,4064.5151999999998,4139.7839999999997]
[457,347,0.75,0.79500000000000004,0.81,0.82499999999999996,3772.44,3998.7864,4074.2352000000001,4149.6839999999993]
[458,348,0.75,0.79500000000000004,0.81,0.82499999999999996,3781.44,4008.3263999999999,4083.9551999999999,4159.5839999999998]
[459,349,0.75,0.79500000000000004,0.81,0.82499999999999996,3790.44,4017.8664000000003,4093.6751999999997,4169.4840000000004]
[460,350,0.75,0.79500000000000004,0.81,0.82499999999999996,3799.44,4027.4063999999998,4103.3951999999999,4179.384]
[461,351,0.75,0.79500000000000004,0.81,0.82499999999999996,3808.44,4036.9463999999998,4113.1152000000002,4189.2839999999997]
[462,352,0.75,0.79500000000000004,0.81,0.82499999999999996,3817.44,4046.4864000000002,4122.8351999999995,4199.1839999999993]
[463,353,0.75,0.79500000000000004,0.81,0.82499999999999996,3826.44,4056.0263999999997,4132.5551999999998,4209.0839999999998]
[464,354,0.75,0.79500000000000004,0.81,0.82499999999999996,3835.44,4065.5663999999997,4142.2752,4218.9840000000004]
[465,355,0.75,0.79500000000000004,0.81,0.82499999999999996,3844.44,4075.1064000000001,4151.9952000000003,4228.884]
[466,356,0.75,0.79500000000000004,0.81,0.82499999999999996,3853.44,4084.6464000000005,4161.7152000000006,4238.7839999999997]
[467,357,0.75,0.79500000000000004,0.81,0.82499999999999996,3862.44,4094.1863999999996,4171.4351999999999,4248.6839999999993]
[468,358,0.75,0.79500000000000004,0.81,0.82499999999999996,3871.44,4103.7264000000005,4181.1552000000001,4258.5839999999998]
[469,359,0.75,0.79500000000000004,0.81,0.82499999999999996,3880.44,4113.2664000000004,4190.8752000000004,4268.4840000000004]
[470,360,0.75,0.79500000000000004,0.81,0.82499999999999996,3889.44,4122.8063999999995,4200.5951999999997,4278.384]
[471,361,0.75,0.79500000000000004,0.81,0.82499999999999996,3898.44,4132.3464000000004,4210.3152,4288.2839999999997]
[472,362,0.75,0.79500000000000004,0.81,0.82499999999999996,3907.44,4141.8864000000003,4220.0352000000003,4298.1839999999993]
[473,363,0.75,0.79500000000000004,0.81,0.82499999999999996,3916.44,4151.4264000000003,4229.7552000000005,4308.0839999999998]
[474,364,0.75,0.79500000000000004,0.81,0.82499999999999996,3925.44,4160.9664000000002,4239.4752000000008,4317.9840000000004]
[475,365,0.75,0.79500000000000004,0.81,0.82499999999999996,3934.44,4170.5064000000002,4249.1952000000001,4327.884]
[476,366,0.75,0.79500000000000004,0.81,0.82499999999999996,3943.44,4180.0464000000002,4258.9152000000004,4337.7839999999997]
[477,367,0.75,0.79500000000000004,0.81,0.82499999999999996,3952.44,4189.5864000000001,4268.6352000000006,4347.6839999999993]
[478,368,0.75,0.79500000000000004,0.81,0.82499999999999996,3961.44,4199.1264000000001,4278.3552,4357.5839999999998]
[479,369,0.75,0.79500000000000004,0.81,0.82499999999999996,3970.44,4208.6664000000001,4288.0752000000002,4367.4840000000004]
[480,370,0.75,0.79500000000000004,0.81,0.82499999999999996,3979.44,4218.2064,4297.7952000000005,4377.384]
[481,371,0.75,0.79500000000000004,0.81,0.82499999999999996,3988.44,4227.7464,4307.5152000000007,4387.2839999999997]
[482,372,0.75,0.79500000000000004,0.81,0.82499999999999996,3997.44,4237.2864,4317.2352000000001,4397.1839999999993]
[483,373,0.75,0.79500000000000004,0.81,0.82499999999999996,4006.44,4246.8263999999999,4326.9552000000003,4407.0839999999998]
[484,374,0.75,0.79500000000000004,0.81,0.82499999999999996,4015.44,4256.3664000000008,4336.6751999999997,4416.9840000000004]
[485,375,0.75,0.79500000000000004,0.81,0.82499999999999996,4024.44,4265.9063999999998,4346.3951999999999,4426.884]
[486,376,0.75,0.79500000000000004,0.81,0.82499999999999996,4033.44,4275.4463999999998,4356.1152000000002,4436.7839999999997]
[487,377,0.75,0.79500000000000004,0.81,0.82499999999999996,4042.44,4284.9864000000007,4365.8351999999995,4446.6839999999993]
[488,378,0.75,0.79500000000000004,0.81,0.82499999999999996,4051.44,4294.5263999999997,4375.5551999999998,4456.5839999999998]
[489,379,0.75,0.79500000000000004,0.81,0.82499999999999996,4060.44,4304.0663999999997,4385.2752,4466.4840000000004]
[490,380,0.75,0.79500000000000004,0.81,0.82499999999999996,4069.44,4313.6064000000006,4394.9952000000003,4476.384]
[491,381,0.75,0.79500000000000004,0.81,0.82499999999999996,4078.44,4323.1464000000005,4404.7152000000006,4486.2839999999997]
[492,382,0.75,0.79500000000000004,0.81,0.82499999999999996,4087.44,4332.6863999999996,4414.4351999999999,4496.1839999999993]
[493,383,0.75,0.79500000000000004,0.81,0.82499999999999996,4096.4400000000005,4342.2264000000005,4424.1552000000001,4506.0839999999998]
[494,384,0.75,0.79500000000000004,0.81,0.82499999999999996,4105.4400000000005,4351.7664000000004,4433.8752000000004,4515.9839999999995]
[495,385,0.75,0.79500000000000004,0.81,0.82499999999999996,4114.4400000000005,4361.3063999999995,4443.5951999999997,4525.884]
[496,386,0.75,0.79500000000000004,0.81,0.82499999999999996,{"$f":"G$119+$B505*C505*12","v":4123.4400000000005},4370.8464000000004,4453.3152,4535.7839999999997]
[497,387,0.75,0.79500000000000004,0.81,0.82499999999999996,4132.4400000000005,4380.3864000000003,4463.0352000000003,4545.6839999999993]
[498,388,0.75,0.79500000000000004,0.81,0.82499999999999996,4141.4400000000005,4389.9264000000003,4472.7552000000005,4555.5839999999998]
[499,389,0.75,0.79500000000000004,0.81,0.82499999999999996,4150.4400000000005,4399.4664000000002,4482.4752000000008,4565.4839999999995]
[500,390,0.75,0.79500000000000004,0.81,0.82499999999999996,4159.4400000000005,4409.0064000000002,4492.1952000000001,4575.384]

{"sheet":"Enamo-Tarif","index":11,"n_rows":7,"n_cols":10,"rows_kept":7,"cut":false,"hidden":true,"merged":[[1,0,3,1]]}
[null,null,null,null,null,null,null,null,"Tarif (brutto)","Tarif (brutto) inkl. Pauschalen"]
["Unterbrechbarer Tarif",null,"Arbeitspreis 06:00 – 22:00 Uhr [cent]",7,2.39,1.5,0.77700000000000002,11.667,14,{"$f":"I2+$I$7*100","v":17.003002729754321}]
[null,null,"Arbeitspreis 22:00 – 06:00 Uhr [cent]",5.6,2.39,1.5,0.77700000000000002,10.266999999999999,12.32,{"$f":"I3+$I$7*100","v":15.323002729754322}]
[null,null,"Grundpreis / Pauschale [€/a]",null,null,null,33,33,39.6]
[null,null,"Messleistung für 2. Zähler",null,null,null,null,24.9,{"$f":"H5*1.2","v":29.879999999999995}]
[null,null,null,null,null,null,null,null,{"$f":"SUM(I4:I5)","v":69.47999999999999}]
[null,null,null,null,null,null,null,null,{"$f":"I6/Eingabe!G21","v":3.0030027297543217E-2}]

{"sheet":"topprodukte-elektro","index":12,"n_rows":63,"n_cols":36,"rows_kept":63,"cut":false,"hidden":true,"merged":[]}
["Marke",null,"Modellname",null,"Kaufpreis",null,"Reichweite mind.",null,"Verbrauch",null,"Spitzengeschwindigkeit",null,"Antriebssystem",null,null,null,null,"Leistung [kW]","max. Drehmoment [Nm]",null,"Batterien",null,null,"Energieinhalt [kWh]","Ladezyklen","der Batterie","Ladegerät",null,null,"Standardladezeit","[h]","Sitzplätze","Anmerkung"]
[null,null,null,null,"inkl. MWSt. [EUR]",null,"[km]",null,"[kWh/100 km]",null,"[km/h]"]
["TESLA",null,"Model S",null,65740,null,502,null,18,null,210,null,"Vierpoliger","Dreiphasen","wechselstrom-","Induktionsmotor","mit Kupferläufer",350,600,null,"Li-Ion",null,null,85,"k.A.",null,"Integriertes Ladegerät",null,null,8,null,"5 Sitzer","Erhältlich auch","mit 60 kWh","Batterie"]
["TESLA",null,"Roadster",null,100000,null,350,null,"k.A.",null,200,null,"3-Phasen","Asynchron",null,null,null,185,"k.A.",null,"Li-Ion",null,null,"k.A.","k.A.",null,"k.A.",null,null,4,null,"2 Sitzer"]
["RENAULT",null,"Zoe",null,20780,null,210,null,15,null,135,null,"fremderregter","Synchronmotor","Rekuperation der","bremsenergie",null,65,220,null,"Li-Ion",null,null,22,"k.A.",null,"Mietbatterie","in Fahrzeug","integriert",9,null,"5 Sitzer","Modelle:","Life, Zen,","Intens"]
["Fiat Umbau durch","MP Eco Drive","E-Ducato Kombi",null,108000,null,200,null,"k.A.",null,90,null,"asynchron mit","Wasserkühlung",null,null,null,140,"k.A.",null,"Li-Ion",null,null,62,"k.A.",null,"k.A.",null,null,8,null,"12 Sitzer"]
["NISSAN",null,"Leaf",null,23390,null,199,null,15,null,144,null,"E-Motor",null,null,null,null,90,254,null,"Li-Ion",null,null,24,"k.A.",null,"Mietbatterie","in Fahrzeug","integriert",8,null,"4 Sitzer","Modelle:","Visia,Acenta,","Tekna"]
["BMW",null,"BMW i3",null,35700,null,190,null,13,null,150,null,"E-synchron","motor",null,null,null,125,250,null,"Li-Ion",null,null,"k.A.","k.A.",null,"k.A.",null,null,6,null,"5 Sitzer"]
["RENAULT",null,"Kangoo",null,24360,null,170,null,16,null,130,null,"fremderregter","Synchronmotor",null,null,null,44,226,null,"Li-Ion",null,null,22,"k.A.",null,"Mietbatterie","in Fahrzeug","integriert",9,null,"2 Sitzer"]
["FORD",null,"Ford Focus Electric",null,39990,null,162,null,15,null,135,null,"k.A.",null,null,null,null,107,250,null,"Li-Ion",null,null,23,"k.A.",null,"Integriertes Ladegerät",null,null,7,null,"5 Sitzer"]
["VW",null,"E-up",null,25350,null,160,null,12,null,130,null,"Permanenterregte","Synchronmaschine","(PSM)",null,null,60,210,null,"Li-Ion",null,null,19,"k.A.",null,"Integriertes Ladegerät",null,null,7,null,"5 Sitzer"]
["CITROEN",null,"C Zero",null,27588,null,150,null,"k.A.",null,130,null,"Permanent-","magnet-","Synchronantrieb",null,null,49,180,null,"Li-Ion",null,null,16,"k.A.",null,"k.A.",null,null,6,null,330,"Modelle:","Attraction","Seduction"]
["MITSUBISHI",null,"i-MiEV",null,29500,null,150,null,"k.A.",null,130,null,"Permanent-","magnetischer","Synchronmotor",null,null,49,180,null,"Li-Ion",null,null,16,"k.A.",null,"k.A.",null,null,8,null,"4 Sitzer"]
["PEUGEOT",null,"i On",null,31800,null,150,null,14,null,130,null,"synchroner","E-Motor",null,null,null,49,180,null,"Li-Ion",null,null,16,"k.A.",null,"in Fahrzeug","eingebaut",null,9,null,"2 Sitzer"]
["SMART",null,"Smart fortwo","electronicdrive",19420,null,145,null,15,null,125,null,"Heck,","Permanent-","Magnet-Motor",null,null,55,130,null,"Li-Ion",null,null,"k.A.","k.A.",null,"k.A.",null,null,7,null,"2 Sitzer"]
["SMART",null,"Brabus",null,"k.A.",null,145,null,18,null,130,null,"Heck, Permanent","-Magnet-Motor",null,null,null,60,135,null,"Li-Ion",null,null,"k.A.","k.A.",null,"k.A.",null,null,7,null,"2 Sitzer"]
["TAZZARI",null,"Tazzari Zero",null,22560,null,140,null,9.1999999999999993,null,100,null,"Asynchron-","Drehstrommotor",null,null,null,15,150,null,"Li-Ion Fe",null,null,12.8,"k.A.",null,"k.A.",null,null,9,null,150,"Modelle:","classic, evo,","Speedster,","Anniversary"]
["STROMOS",null,"Coolcar Van",null,"k.A.",null,110,null,"k.A.",null,90,null,"k.A.",null,null,null,null,20,"k.A.",null,"Blei Gel",null,null,"k.A.","k.A.",null,"k.A.",null,null,8,null,"5 Sitzer"]
["RENAULT",null,"Twizy",null,6990,null,100,null,"5,8/6,1",null,"45/80",null,"Drehstrom","Rekuperation der","bremsenergie",null,null,3,"33-57",null,"Li-Ion",null,null,6,"k.A.",null,"Mietbatterie","in Fahrzeug","integriert",4,null,"2 Sitzer","Modelle:","Urban, Technic"]
["STROMOS",null,"Coolcar",null,"k.A.",null,90,null,"k.A.",null,90,null,"k.A.",null,null,null,null,20,"k.A.",null,"Blei Gel",null,null,"k.A.","k.A.",null,"k.A.",null,null,8,null,"4 Sitzer","Modell:","Indimo Coolcar"]
["NF",null,"Nano",null,"ab 18.500",null,90,null,"k.A.",null,43,null,"k.A.",null,null,null,null,3,"k.A.",null,"k.A.",null,null,"k.A.","k.A.",null,"k.A.",null,null,8,null,"2 Sitzer","Karosse aus","Kunststoff"]
["OPEL",null,"Ampera",null,38400,null,83,null,19,null,161,null,"E-Motor",null,null,null,null,111,130,null,"Li-Ion",null,null,16,"k.A.",null,"Integriertes Ladegerät",null,null,6,null,"5 Sitzer","Erweiterte Reichweite","durch eingebauten","Benzinmotor","als Stromgenerator"]
["CHEVROLET",null,"Volt",null,38000,null,80,null,17,null,160,null,"E-Motor",null,null,null,null,111,130,null,"Li-Ion",null,null,16,"k.A.",null,"Integriertes Ladegerät",null,null,6,null,"5 Sitzer","Erweiterte Reichweite","durch eingebauten","Benzinmotor","als Stromgenerator"]
["Estrima Biro",null,"Estrima Biro",null,8868,null,50,null,"k.A.",null,45,null,"k.A.",null,null,null,null,4,"k.A.",null,"Blei Gel",null,null,"k.A.","k.A.",null,"k.A.",null,null,"k.A.",null,"2 Sitzer"]
["Start Lab",null,"Start Lab",null,8300,null,50,null,13,null,45,null,"Gleichstrommotor",null,null,null,null,4,"Motorumdrehung","-4.100/3.500 U/min","Blei-Gel,","4x Northstar","NSB125","k.A.","k.A.",null,"Integriertes Ladegerät",null,null,7,null,"3 Sitzer"]
["MITSUBISHI",null,"Outlander PHEV",null,"k.A.",null,50,null,"k.A.",null,"k.A.",null,"Permanent","magnetischer","Synchronmotor",null,null,70,"137 vorne","195 hinten","Li-Ion",null,null,12,"k.A.",null,"Integriertes Ladegerät",null,null,4,null,"5 Sitzer","Plug-in-Hybrid","mit EV-System","(Benzimotor als","Generator)"]
[]
[]
[]
[]
[]
[]
[]
[]
[]
[]
[]
[]
[]
[]
[]
[]
[null,null,null,null,null,null,null,null,null,null,null,null,null,null,null,null,null,null,null,null,null,null,null,null,null,"Marke und"]
[null,null,null,null,null,null,null,null,null,null,null,null,null,null,null,null,null,null,null,null,null,null,null,null,null,"Modell anonymisiert"]
[null,null,null,null,null,null,null,null,null,null,null,null,null,null,null,null,null,null,null,null,null,null,null,null,null,"k.A."]
[]
[null,null,null,null,null,null,null,null,null,null,null,null,null,null,null,null,null,null,null,null,null,null,null,null,null,"k.A."]
[]
[]
[null,null,null,null,null,null,null,null,null,null,null,null,null,null,null,null,null,null,null,null,null,null,null,null,null,7.3]
[]
[null,null,null,null,null,null,null,null,null,null,null,null,null,null,null,null,null,null,null,null,null,null,null,null,null,171]
[]
[null,null,null,null,null,null,null,null,null,null,null,null,null,null,null,null,null,null,null,null,null,null,null,null,null,5]
[null,null,null,null,null,null,null,null,null,null,null,null,null,null,null,null,null,null,null,null,null,null,null,null,null,5]
[null,null,null,null,null,null,null,null,null,null,null,null,null,null,null,null,null,null,null,null,null,null,null,null,null,110]
[]
[null,null,null,null,null,null,null,null,null,null,null,null,null,null,null,null,null,null,null,null,null,null,null,null,null,150]
[]
[null,null,null,null,null,null,null,null,null,null,null,null,null,null,null,null,null,null,null,null,null,null,null,null,null,"M5"]
[null,null,null,null,null,null,null,null,null,null,null,null,null,null,null,null,null,null,null,null,null,null,null,null,null,"k.A."]
[null,null,null,null,null,null,null,null,null,null,null,null,null,null,null,null,null,null,null,null,null,null,null,null,null,"k.A."]
[null,null,null,null,null,null,null,null,null,null,null,null,null,null,null,null,null,null,null,null,null,null,null,null,null,"k.A."]

{"sheet":"topprodukte-benzin-diesel","index":13,"n_rows":182,"n_cols":36,"rows_kept":182,"cut":false,"hidden":true,"merged":[]}
["MARKE","Modell",null,"Motor",null,"Kaufpreis bei","Grundausstattung","[ab EUR] inkl MWSt.","Kraftstoff","Benzin/Diesel","CO2-Emissionen","[g/km]","EU-Abgasnorm","Sitzplätze","Leistung","[kW]","Leistung","[PS]","Getriebe","Länge [mm]","Breite mit Außenspiegel [mm]","Höhe ohne Dachreeling [mm]","andere Motoren","(Verbrauch, CO2-Emission,","Leistung [kW], Leistung [PS])",null,null,"Modellvarianten"]
["Audi","A1 SB","25 TSFI",null,null,21780,null,null,5.6,"Benzin",126,null,"6d-TEMP",4,70,null,95,null,"M5",3954,1906,1416,1110,"30 TSFI","(4.8,122,85,116)",null,"advanced,","S-line",null,null,"S-line"]
["Audi","A3 SB","30 TDI",null,null,29600,null,null,4.4000000000000004,"Benzin",114,null,"6d-TEMP",5,85,null,115,null,"M6",4313,1785,1426,1360,"35 TDI","(4.4,115,110,150)",null,null,"sport, design",null,null,null,null,null,null,"Auch als Combi","erhältlich"]
["Audi","A4 Limousine","30 TDI",null,null,36970,null,null,4.9000000000000004,"Benzin",128,null,"6d-TEMP",5,90,null,122,null,"M6",4762,2022,1428,1540,"35 TDI","(5.0,131,120,163)","40 TDI","(5.2,136,140,190)","advanced, S line",null,null,null,null,null,null,"Auch als Combi","erhältlich"]
["Audi","A3 SB","30 TDI",null,null,29600,null,null,4.4000000000000004,"Diesel",114,null,"6d-TEMP",5,85,null,115,null,"M6","4 313","1 785","1 426","1 360","35 TDI","(4.4,115,110,150)",null,null,"sport, design"]
["Audi","A4 Limousine","30 TDI",null,null,36970,null,null,4.9000000000000004,"Diesel",128,null,"6d-TEMP",5,90,null,122,null,"M6","4 762","2 022","1 428","1 540","35 TDI","(5.0,131,120,163)","40 TDI","(5.2,136,140,190)","advanced, S line",null,null,"erhältlich"]
["BMW","2er Gran Tourer","216i",null,null,31350,null,null,6.4,"Benzin",146,null,"6d-TEMP",5,80,null,109,null,"AMT6",4556,1800,1608,1515,"218i","(6.5,146,103,140)","220i","(6.8,154,141,192)"]
["BMW","1er Limousine","116d",null,null,31160,null,null,4.5,"Benzin",118,null,"6d",5,85,null,115,null,"M6",4319,1799,1434,1375,"118d","(4.7,122,11,150)"]
["BMW","3er Limousine","318d",null,null,38950,null,null,4.8,"Benzin",125,null,"6d-TEMP",5,110,null,150,null,"M6",4709,2068,1435,1520,"320d","(4.9,128,140,190)",null,null,null,null,null,"Kompakt-Van"]
["BMW","2er Active Tourer","216d",null,null,32050,null,null,4.7,"Benzin",123,null,"6d",5,85,null,116,null,"M6",4354,2039,1555,1495,"218d","(4.9,129,110,150)","220d","(5.1,134,140,190)",null,null,"Länge entspricht","Live",null,"Als 3-Türer oder","5-Türer erhältlich"]
["BMW","2er Gran Tourer","216d",null,null,33600,null,null,4.9000000000000004,"Benzin",128,null,"6d",5,85,null,116,null,"M6",4565,2038,1606,1560,"218d","(5.1,134,110,150)","220d","(5.3,140,140,190)",null,null,null,null,"Feel, Shine, Live"]
["BMW","1er Limousine","116d",null,null,31160,null,null,4.5,"Diesel",118,null,"6d",5,85,null,115,null,"M6","4 319","1 799","1 434","1 375","118d","(4.7,122,11,150)"]
["BMW","3er Limousine","318d",null,null,38950,null,null,4.8,"Diesel",125,null,"6d-TEMP",5,110,null,150,null,"M6","4 709","2 068","1 435","1 520","320d","(4.9,128,140,190)",null,null,null,null,null,null,null,"Auch als 7-Sitzer","erhältlich"]
["BMW","2er Active Tourer","216d",null,null,32050,null,null,4.7,"Diesel",123,null,"6d",5,85,null,116,null,"M6","4 354","2 039","1 555","1 495","218d","(4.9,129,110,150)","220d","(5.1,134,140,190)",null,null,"Länge entspricht"]
["Citroen","C1 ","VTi 72",null,null,11490,null,null,4.8,"Benzin",110,null,"6d-TEMP",4,53,null,72,null,"M5",3466,1884,1460,867,null,null,null,"Feel, Shine, Origins"]
["Citroen","C3","PureTech 82",null,null,13390,null,null,5.7,"Benzin",127,null,"6d-TEMP-EVAP",5,61,null,83,null,"M5",3996,2009,1490,1037,"PureTech 110","(5.8,131,81,110)",null,"Feel, Shine"]
["Citroen","C3 Aircross","PureTech 110","S&S",null,20320,null,null,6.2,"Benzin",141,null,"6d-TEMP-EVAP",5,81,null,110,null,"M6",4154,1976,1597,1247,"PureTech 130","(6.6,148,96,130)",null,null,"Feel, Shine, C-Series"]
["Citroen","Grand C4 Spacetourer","PureTech 130","Start&Stop",null,28550,null,null,6.3,"Benzin",143,null,"6d-TEMP-EVAP",7,96,null,131,null,"M6",4597,2117,1638,1423,null,null,null,null,"Feel, Shine"]
["Citroen","C5 Aircross","PureTech 130","Start&Stop",null,26690,null,null,6.6,"Benzin",149,null,"6d-TEMP",5,96,null,131,null,"M6",4500,2099,1654,1468,null,null,null,null,"Live, Feel",null,null,"Spacetourer erhältlich"]
["Citroen","C4 Cactus","BlueHDi 100","S&S",null,20275,null,null,4.5,"Benzin",118,null,"6d-TEMP",5,75,null,102,null,"M6",4170,1979,1480,1148,"BlueHDi 120","(5.0, 130, 88, 120)",null,null,"Feel, Shine"]
["Citroen","C3 Aircross","Blue HDi 100","S&S",null,20790,null,null,4.7,"Benzin",123,null,"6d-TEMP",5,75,null,102,null,"M6",4154,1976,1597,1292,"Blue HDi 120","(5.2,137,88,120)",null,null,"Feel, Shine"]
["Citroen","C4 Spacetourer","BlueHDi 130","Start&Stop",null,28400,null,null,5,"Benzin",130,null,"6d-TEMP",5,96,null,130,null,"M6",4438,1826,1610,1410,null,null,null,null,"Feel",null,null,null,"Ambiance, Supreme"]
["Citroen","C5 Aircross","BlueHDi 130","Start&Stop",null,29390,null,null,5.2,"Benzin",138,null,"6d-TEMP",5,96,null,130,null,"M6",4500,1969,1654,1507,null,null,null,null,"Live, Feel,","Shine, C-Series"]
["Citroen","C3","BlueHDi 100","Start&Stop",null,18290,null,null,4.5,"Diesel",117,null,"6d-TEMP",5,75,null,102,null,"M5",3996,2009,1474,1146,null,null,null,"Feel, Shine"]
["Citroen","C4 Cactus","BlueHDi 100","S&S",null,20275,null,null,4.5,"Diesel",118,null,"6d-TEMP",5,75,null,102,null,"M6","4 170","1 979","1 480","1 148","BlueHDi 120","(5.0, 130, 88, 120)",null,null,"Feel, Shine"]
["Citroen","C3 Aircross","Blue HDi 100","S&S",null,20790,null,null,4.7,"Diesel",123,null,"6d-TEMP",5,75,null,102,null,"M6","4 154","1 976","1 597","1 292","Blue HDi 120","(5.2,137,88,120)",null,null,"Feel, Shine",null,null,"erhältlich"]
["Dacia","Logan MCV","SCe 75 S&S",null,null,8590,null,null,5.7,"Benzin",129,null,"6d-TEMP",5,54,null,73,null,"M5",4501,1994,1521,1112,"TCe 90 S&S","(5.9,133,66,90)",null,null,null,null,"Access, Essential,","Performance Line"]
["Dacia","Sandero","SCe 75",null,null,7790,null,null,5.7,"Benzin",129,null,"6d-TEMP",5,54,null,73,null,"M5",4069,1994,1555,1052,"TCe 90","(5.9,133,66,90)",null,null,"Access, Essential,","Comfort, Stepway,","Celebration"]
["Dacia","Duster","TCe 100",null,null,12990,null,null,6.1,"Benzin",138,null,"6d-TEMP",5,74,null,100,null,"M5",4341,2052,1693,1191,"TCe 130","(6.6,149,96,130)","TCe 150","(7.1,162,110,150)","Access, Comfort,","Essential, Prestige,","Celebration","Mirror, Lounge, Pop"]
["Dacia","Sandero","Blue dCi 75","S&S",null,11340,null,null,4.4000000000000004,"Benzin",116,null,"6d-TEMP",5,55,null,75,null,"M5",4069,1994,1555,1190,"dCi 95","(4.4,116,70,95)",null,null,"Comfort, Stepway,","Celebration"]
["Dacia","Lodgy","Blue dCi 95",null,null,15350,null,null,4.8,"Benzin",126,null,"6d-TEMP",5,70,null,95,null,"M6",4498,2004,1682,1263,"Blue dCi 115","(4.8,126,85,115)",null,null,"Supreme, Stepway"]
["Dacia","Duster","Blue dCi 95",null,null,15490,null,null,4.9000000000000004,"Benzin",128,null,"6d-TEMP",5,70,null,95,null,"M6",4341,2052,1693,1314,"Blue dCi 115","(4.9,128,85,115)",null,null,"Essential, Comfort,","Prestige, Celebration"]
["Dacia","Dokker","Blue dCi 95",null,null,14250,null,null,5,"Benzin",132,null,"6d-TEMP",5,70,null,95,null,"M6",4363,2004,1804,1368,null,null,null,null,"Supreme, Stepway"]
["Dacia","Sandero","Blue dCi 75","S&S",null,11340,null,null,4.4000000000000004,"Diesel",116,null,"6d-TEMP",5,55,null,75,null,"M5","4 069","1 994","1 555","1 190","dCi 95","(4.4,116,70,95)",null,null,"Comfort, Stepway,","Celebration",null,"(4.9,112,103,140)","Trend, Titanium,","ST-Line, Vignale",null,"Auch als 5-Türer","erhältlich"]
["DS Automobiles","DS 7","BlueHDi 130",null,null,41290,null,null,5.2,"Benzin",136,null,"6d-TEMP",5,96,null,130,null,"A8",4573,2098,1625,1527,"BlueHDI 180","(6.1,161,130,180)",null,null,"Be Chic, So Chic,","Performance Line",null,null,"Trend, Titanium,","Active, ST-Line,","Vignale","Auch als Kombi","erhältlich "]
["Fiat",500,"1.2 Fire 70","Dualogic",null,18170,null,null,5.5,"Benzin",135,null,"6d-TEMP-EVAP",4,51,null,69,null,"A5",3571,1627,1488,900,null,null,null,"500C, 500S","Lounge, Sport","Star, Rockstar","Hybrid-Variante","(5.5,125,134,182)","Trend, Titanium,","ST-Line, Vignale"]
["Fiat","Panda","1.2 Fire 70",null,null,12100,null,null,5.7,"Benzin",133,null,"6d-TEMP-EVAP-ISC",4,51,null,69,null,"M5",3653,1882,1551,980,null,null,null,null,"Easy, Lounge",null,null,"Kompakt-Van"]
["Fiat","Tipo Kombi","MultiJet 95 SCR",null,null,21170,null,null,4.5999999999999996,"Benzin",120,null,"6d-TEMP-EVAP",5,70,null,95,null,"M5",4571,1792,1514,1395,"MultiJet 120 SCR","(5.1,130,88,120)",null,null,"Street, Mirror,","Lounge, S-Design",null,"Kompakt-Van"]
["Fiat","500X Urban","1.6 MultiJet","95 SCR",null,22100,null,null,4.8,"Benzin",126,null,"6d-TEMP-EVAP-ISC",5,70,null,95,null,"M5",4264,2025,1595,1320,"1.6 MultiJet","(5.2,137,88,120)",null,null,"Lounge, Cross, Sport",null,"Länge entspricht","Titanium"]
["Fiat","Tipo Kombi","MultiJet 95 SCR",null,null,21170,null,null,4.5999999999999996,"Diesel",120,null,"6d-TEMP-EVAP",5,70,null,95,null,"M5","4 571","1 792","1 514","1 395","MultiJet 120 SCR","(5.1,130,88,120)",null,null,"Street, Mirror,","Lounge, S-Design"]
["Fiat","500X Urban","1.6 MultiJet","95 SCR",null,22100,null,null,4.8,"Diesel",126,null,"6d-TEMP-EVAP-ISC",5,70,null,95,null,"M5","4 264","2 025","1 595","1 320","1.6 MultiJet","(5.2,137,88,120)",null,null,"Lounge, Cross, Sport",null,"Länge entspricht"]
["Ford","Fiesta Coupe","1.0 Ecoboost","Start&Stop",null,15300,null,null,5.0999999999999996,"Benzin",115,null,"6d-TEMP-EVAP-ISC",5,70,null,95,null,"M6",4065,1941,1466,1163,"1.1l","(5.3,120,55,75)","1.0 Ecoboost","(5.1,115,70,95)","1.0 Ecoboost","(5.6,127,92,125)","Trend, Cool-Connect,","erhältlich"]
["Ford","Focus","1.0 EcoBoost",null,null,22100,null,null,5.3,"Benzin",119,null,"6d-TEMP-EVAP-ISC",5,74,null,100,null,"M6",4378,1979,1471,1322,"1.0 EcoBoost","(5.5, 124, 92, 125)","1.0 EcoBoost","(5.9,133,92,125)","1.5 EcoBoost","(6.3,142,110,150)","Trend, Titanium,"]
["Ford","Focus Turnier","1.0 EcoBoost",null,null,23600,null,null,5.3,"Benzin",119,null,"6d-TEMP-EVAP-ISC",5,74,null,100,null,"M6",4668,1979,1494,1383,"1.0 EcoBoost","(5.6,126,92,125)","1.5 EcoBoost","(5.8,132,110,150)","1.5 EcoBoost","(6.0,137,134,182)","Trend, Titanium,","Kompakt-Van"]
["Ford","EcoSport","1.0 EcoBoost",null,null,20300,null,null,5.9,"Benzin",134,null,"6d-TEMP-EVAP-ISC",5,74,null,100,null,"M6",4096,2057,1653,1349,"1.0 EcoBoost","(6.0,135,92,125)","1.0 EcoBoost","(6.0,136,103,140)","ST-Line, Trend","Titanium,","Cool & Connect","Kompakt-Van"]
["Ford","Fiesta","1.5 TDCi","Start&Stop",null,16650,null,null,4.2,"Benzin",111,null,"6d-TEMP-EVAP-ISC",5,63,null,85,null,"M6",4040,1735,1476,1194,null,null,null,null,"Trend, Titanium","Cool&Connect,","ST-Line",null,"Comfort, Elegance,","Executive, Dynamic,","Sport"]
["Ford","Focus","1.5 l EcoBlue",null,null,23650,null,null,4.5,"Benzin",117,null,"6d-TEMP-EVAP-ISC",5,70,null,95,null,"M6",4378,1825,1454,1363,"1.5 EcoBlue","(4.5,117,88,120)","2.0 EcoBlue","(4.7,124,110,150)","Trend, Titanium","ST-Line, Vignale,","Active,","Executive"]
["Ford","Puma","1.5 l EcoBlue",null,null,25890,null,null,4.5,"Benzin",118,null,"6d-TEMP-EVAP-ISC",5,88,null,120,null,"M6",4186,1930,1536,1280,null,null,null,null,"Titanium, ST-Line"]
["Ford","Focus Turnier","1.5 EcoBlue",null,null,25150,null,null,4.5,"Benzin",119,null,"6d-TEMP-EVAP-ISC",5,70,null,95,null,"M6",4668,1979,1494,1413,"1.5 EcoBlue","(4.5,119,88,120)","2.0 EcoBlue","(4.7,124,110,150)","Trend, Titanium,","ST-Line, Vignale,","Active,",null,"Level 1,2,3,4,5",null,null,"Auch als 3-Türer","erhältlich"]
["Ford","Mondeo","2.0l EcoBlue SCR",null,null,34100,null,null,4.9000000000000004,"Benzin",128,null,"6d-TEMP",5,88,null,120,null,"M6",4871,2121,1482,1707,"2.0l EcoBlue","(5.0,131,110,150)","2.0l EcoBlue","(5.3,140,140,190)","Trend, Titanium,","ST-Line, Vignale",null,null,"Level 2,3,4,5,6"]
["Ford","EcoSport","1.5 l EcoBlue",null,null,23700,null,null,4.9000000000000004,"Benzin",129,null,"6d-TEMP-EVAP-ISC",5,74,null,100,null,"M6",4096,2057,1653,1395,"1.5 EcoBlue","(5.3,138,88,120)",null,null,"ST-Line, Titanium","Cool&Connect","Höhe entspricht"]
["Ford","Tourneo Courier","1.5 TDCi S&S",null,null,18142,null,null,5.4,"Benzin",141,null,"6d-TEMP-EVAP-ISC",5,55,null,75,null,"M6",4157,2112,1741,1420,"1.5 TDCi SS","(5.5,144,74,101)",null,null,"Trend, Titanium, Sport",null,"Höhe entspricht"]
["Ford","Fiesta","1.5 TDCi","Start&Stop",null,16650,null,null,4.2,"Diesel",111,null,"6d-TEMP-EVAP-ISC",5,63,null,85,null,"M6","4 040","1 735","1 476","1 194",null,null,null,null,"Trend, Titanium","Cool&Connect,","ST-Line","erhältlich"]
["Ford","Focus","1.5 l EcoBlue",null,null,23650,null,null,4.5,"Diesel",117,null,"6d-TEMP-EVAP-ISC",5,70,null,95,null,"M6","4 378","1 825","1 454","1 363","1.5 EcoBlue","(4.5,117,88,120)","2.0 EcoBlue","(4.7,124,110,150)","Trend, Titanium","ST-Line, Vignale,","Active,"]
["Ford","Puma","1.5 l EcoBlue",null,null,25890,null,null,4.5,"Diesel",118,null,"6d-TEMP-EVAP-ISC",5,88,null,120,null,"M6","4 186","1 930","1 536","1 280",null,null,null,null,"Titanium, ST-Line"]
["Ford","Focus Turnier","1.5 EcoBlue",null,null,25150,null,null,4.5,"Diesel",119,null,"6d-TEMP-EVAP-ISC",5,70,null,95,null,"M6","4 668","1 979","1 494","1 413","1.5 EcoBlue","(4.5,119,88,120)","2.0 EcoBlue","(4.7,124,110,150)","Trend, Titanium,","ST-Line, Vignale,","Active,",null,"Gold, Silber,","Titan, Platin",null,"Auch als Kombi","erhältlich "]
["Ford","Mondeo","2.0l EcoBlue SCR",null,null,34100,null,null,4.9000000000000004,"Diesel",128,null,"6d-TEMP",5,88,null,120,null,"M6","4 871","2 121","1 482","1 707","2.0l EcoBlue","(5.0,131,110,150)","2.0l EcoBlue","(5.3,140,140,190)","Trend, Titanium,","ST-Line, Vignale",null,null,"Gold, Silber","Titan, Platin"]
["Ford","EcoSport","1.5 l EcoBlue",null,null,23700,null,null,4.9000000000000004,"Diesel",129,null,"6d-TEMP-EVAP-ISC",5,74,null,100,null,"M6","4 096","2 057","1 653","1 395","1.5 EcoBlue","(5.3,138,88,120)",null,null,"ST-Line, Titanium","Cool&Connect","Höhe entspricht"]
["Ford","Tourneo Courier","1.5 TDCi S&S",null,null,18142,null,null,5.4,"Diesel",141,null,"6d-TEMP-EVAP-ISC",5,55,null,75,null,"M6","4 157","2 112","1 741","1 420","1.5 TDCi SS","(5.5,144,74,101)",null,null,"Trend, Titanium, Sport",null,"Höhe entspricht"]
["Honda","Civic","1.0 VTEC","Turbo",null,22890,null,null,5.7,"Benzin",128,null,"6d-TEMP",5,93,null,126,null,"M6",4518,2076,1434,1229,"1.5 VTEC Turbo","(6.1,139,134,182)",null,null,null,null,"Comfort, Elegance,","erhältlich"]
["Honda","HR-V","1,5 i-VTEC",null,null,23290,null,null,6.6,"Benzin",148,null,"6d-TEMP",5,96,null,131,null,"M6",4294,1772,1605,1243,null,null,null,null,"Comfort, Elegance,","Executive",null,null,"Attraction","Takumi, Revolution"]
["Honda","Civic","1.6i-DTEC",null,null,24390,null,null,4.5999999999999996,"Benzin",121,null,"6d-TEMP",5,88,null,120,null,"M6",4518,2079,1434,1342,null,null,null,null,"Elegance, Executive,","S, Comfort"]
["Honda","HR-V","1.6 i-DTEC",null,null,25790,null,null,5,"Benzin",132,null,"6d-TEMP",5,88,null,120,null,"M6",4294,1772,1689,1395,null,null,null,null,"Comfort. Elegance,","Executive",null,null,null,null,null,"Auch als Combi","erhältlich"]
["Honda","Civic","1.6i-DTEC",null,null,24390,null,null,4.5999999999999996,"Diesel",121,null,"6d-TEMP",5,88,null,120,null,"M6","4 518","2 079","1 434","1 342",null,null,null,null,"Elegance, Executive,","S, Comfort"]
["Hyundai","i10","1.0l",null,null,10990,null,null,4.8,"Benzin",110,null,"6d-TEMP-EVAP",4,49,null,67,null,"M5",3670,1680,1480,924,"1.2l (5.2,117,62,84)",null,null,"Level 1,2,3,4",null,null,"Auch als 5-Sitzer","erhältlich"]
["Hyundai","i20","1.0 T-GDI",null,null,17190,null,null,5.5,"Benzin",126,null,"6d-TEMP-EVAP",5,74,null,100,null,"M5",4035,1734,1474,1065,"1.25l","(5.9,133,55,75)","1.25l","(5.8,132,62,84)","1.0 TGDI","(5.6,137,88,120)","Level 1,2,3,4,5"]
["Hyundai","i30 Combi","1.0 T-GDI",null,null,20590,null,null,5.4,"Benzin",123,null,"6d-TEMP-EVAP",5,88,null,120,null,"M6",4585,2039,1465,1231,"1.5 DPI","(6.0,137,81,110)",null,null,null,null,"Level 2,3,4,5,6"]
["Hyundai","Kona","1.0 T-GDi",null,null,20690,null,null,6.2,"Benzin",142,null,"6d-TEMP-EVAP",5,88,null,120,null,"M6",4165,2070,1550,1223,null,null,null,null,"Level 2,3,4,6",null,null,"Kompakt-Van"]
["Hyundai","i30","1.6 CRDi",null,null,22590,null,null,4.5999999999999996,"Benzin",118,null,"6d-TEMP-EVAP",5,85,null,115,null,"M6",4340,1795,1455,1313,null,null,null,null,"Level 2,3,4,5,6",null,null,"Invite Connect"]
["Hyundai","i30 CW","1.6 CRDi",null,null,22590,null,null,4.5,"Benzin",118,null,"6d-TEMP-EVAP",5,85,null,116,null,"M6",4585,2039,1465,1370,"1.6 CRDi","(4.6,120,100,136)",null,null,"Level 2,3,4,5,6"]
["Hyundai","Kona","1.6 CRDi",null,null,22690,null,null,5,"Benzin",129,null,"6d-TEMP-EVAP",5,85,null,116,null,"M6",4165,2070,1550,1318,"1.6 CRDi","(5.1,134,100,136)",null,null,"Level 2,3,4,6"]
["Hyundai","i30","1.6 CRDi",null,null,22590,null,null,4.5999999999999996,"Diesel",118,null,"6d-TEMP-EVAP",5,85,null,115,null,"M6","4 340","1 795","1 455","1 313",null,null,null,null,"Level 2,3,4,5,6",null,null,null,"Edition, Dynamic","Innovation",null,"Auch als Kombi","erhältlich "]
["Hyundai","i30 CW","1.6 CRDi",null,null,22590,null,null,4.5,"Diesel",118,null,"6d-TEMP-EVAP",5,85,null,116,null,"M6","4 585","2 039","1 465","1 370","1.6 CRDi","(4.6,120,100,136)",null,null,"Level 2,3,4,5,6",null,null,null,"Edition, Dynamic,","Innovation"]
["Hyundai","Kona","1.6 CRDi",null,null,22690,null,null,5,"Diesel",129,null,"6d-TEMP-EVAP",5,85,null,116,null,"M6","4 165","2 070","1 550","1 318","1.6 CRDi","(5.1,134,100,136)",null,null,"Level 2,3,4,6",null,null,null,"Edition, Dynamic,","Innovation,","Ultimate","Auch als Combi","erhältlich"]
["KIA","Picanto","1.0 MPI ISG",null,null,10190,null,null,5.0999999999999996,"Benzin",116,null,"6d-TEMP-EVAP",4,49,null,67,null,"M5",3595,1595,1485,588,"1.2 MPI ISG","(5.6,126,62,84)",null,"Neon, Titan, Silber,","Gold, GT-Line, X-Line",null,"Auch als 5-Sitzer","Edition, Ultimate","Innovation"]
["KIA","Rio","1.0 TGDI GPF ISG",null,null,18090,null,null,5.5,"Benzin",126,null,"6d-TEMP-EVAP",5,74,null,100,null,"M5",4065,1725,1450,1080,"1.25 MPI ISG","(5.8,132,62,84)","1.0 TGDI GPF ISG","(5.8,133,88,120)",null,null,"Neon, Titan, Silber,","Edition, Ultimate","Innovation"]
["KIA","Ceed","1.0 TGDI GPF ISG",null,null,17790,null,null,5.6,"Benzin",126,null,"6d-TEMP-EVAP",5,74,null,100,null,"M6",4310,1800,1447,1222,"1.0 TGDI GPF ISG","(5.6,126,88,120)","1.4 TGDI GPF ISG","(5.9,135,103,140)",null,null,"Titan, Silber,Gold","Innovation"]
["KIA","Ceed SW","1.0 TGDI GPF ISG",null,null,18990,null,null,5.6,"Benzin",127,null,"6d-TEMP-EVAP",5,74,null,100,null,"M6",4600,1800,1465,1259,"1.4 TGDI ISG","(5.9,135,103,140)",null,null,null,null,"Titan, Silber, Gold,"]
["KIA","ceed SW","1.6 CRDi ISG",null,null,22790,null,null,4.5999999999999996,"Benzin",121,null,"6d-TEMP-EVAP",5,85,null,116,null,"M6",4600,1800,1465,1350,"1.6 CRDi ISG","(4.8,125,100,136)",null,null,"Gold, Silber","Titan, Platin,","GT-Line"]
["KIA","Sportage","1.6 CRDI SCR",null,null,31190,null,null,5.3,"Benzin",135,null,"6d-TEMP-EVAP",5,85,null,116,null,"M6",4485,1855,1635,1534,"1.6 CRDI SCR","(5.4,141,100,136)",null,null,"Titan, Silber,","Gold, Platin,","GT-Line"]
["KIA","ceed SW","1.6 CRDi ISG",null,null,22790,null,null,4.5999999999999996,"Diesel",121,null,"6d-TEMP-EVAP",5,85,null,116,null,"M6","4 600","1 800","1 465","1 350","1.6 CRDi ISG","(4.8,125,100,136)",null,null,"Gold, Silber","Titan, Platin,","GT-Line"]
["Mazda",2,"G75 Life",null,null,14690,null,null,5.3,"Benzin",120,null,"6d",5,55,null,75,null,"M6",4070,1695,1495,1100,"G90","(5.3,120,66,90)",null,null,null,null,"Life, Takumi,"]
["Mercedes","A-Klasse","A 180",null,null,29670,null,null,5.9,"Benzin",133,null,"6d ISC-FCM",5,100,null,136,null,"M6",4549,1796,1446,1360,"A 200","(5.8,131,120,163)"]
["Mercedes","A-Klasse","160 d",null,null,29590,null,null,4.5,"Benzin",118,null,"6d-TEMP-EVAP-ISC",5,70,null,95,null,"M6",4419,1796,1440,1425,"A180d","(4.5,118,85,116)","A200d","(4.8,125,110,150)",null,null,null,"GT-Line, Signature"]
["Mercedes","CLA-Klasse","180 d",null,null,35460,null,null,4.5,"Benzin",118,null,"6d-TEMP-EVAP-ISC",5,85,null,116,null,"M6",4688,1830,1439,1470,"200d","(4.8,125,110,150)","220d","(4.8,127,140,190)",null,null,null,null,"Active, Style, GT-Line","Access, Allure",null,"Auch als Kombi","erhältlich "]
["Mercedes","C-Klasse","200 d",null,null,40470,null,null,4.8,"Benzin",127,null,"6d-ISC-FCM",5,118,null,160,null,"M6",4686,1810,1442,1555,"180d","(5.0,130,90,122)","220d","(5.0,132,143,194)",null,null,null,null,"Active, Style,","Access, Allure"]
["Mercedes","A-Klasse","160 d",null,null,29590,null,null,4.5,"Diesel",118,null,"6d-TEMP-EVAP-ISC",5,70,null,95,null,"M6","4 419","1 796","1 440","1 425","A180d","(4.5,118,85,116)","A200d","(4.8,125,110,150)",null,null,null,null,"Active, Allure,","GT Line",null,"Auch als Combi","erhältlich"]
["Mercedes","CLA-Klasse","180 d",null,null,35460,null,null,4.5,"Diesel",118,null,"6d-TEMP-EVAP-ISC",5,85,null,116,null,"M6","4 688","1 830","1 439","1 470","200d","(4.8,125,110,150)","220d","(4.8,127,140,190)"]
["Mercedes","C-Klasse","200 d",null,null,40470,null,null,4.8,"Diesel",127,null,"6d-ISC-FCM",5,118,null,160,null,"M6","4 686","1 810","1 442","1 555","180d","(5.0,130,90,122)","220d","(5.0,132,143,194)",null,null,null,"Access, GT Line,","Crossway","Auch als 7-Sitzer","erhältlich"]
["Mini","Mini 3-Türer","One First",null,null,19750,null,null,5.8,"Benzin",133,null,"6d-TEMP",4,55,null,75,null,"M6",3821,1727,1414,1215,"One (5.0,114,75,102),","Cooper","(5.0,115,100,136)","Salt, Pepper, Chili",null,null,"Auch als 5-Türer","Access, GT Line,","Crossway","Auch als 7-Sitzer","erhältlich"]
["Mini","Countryman","One",null,null,28500,null,null,4.9000000000000004,"Benzin",129,null,"6d-TEMP",5,85,null,116,null,"M6",4299,1822,1557,1505,"Cooper D","(5.0,130,110,150)","Cooper SD","(5.3,139,140,190)","One, Cooper",null,"Länge entspricht"]
["Mini","Countryman","One",null,null,28500,null,null,4.9000000000000004,"Diesel",129,null,"6d-TEMP",5,85,null,116,null,"M6","4 299","1 822","1 557","1 505","Cooper D","(5.0,130,110,150)","Cooper SD","(5.3,139,140,190)","One, Cooper",null,"Länge entspricht"]
["MItsubishi","Space Star","1.0 MIVEC AS&G",null,null,12990,null,null,5.0999999999999996,"Benzin",115,null,"6d-TEMP",5,52,null,71,null,"M5",3795,1665,1505,870,"1.2 MIVEC AS&G","(5.3, 121, 59, 80)",null,"Inform,","Invite Connect"]
["Nissan","Micra","1.0 IGT 100",null,null,15090,null,null,5.6,"Benzin",126,null,"6d-TEMP",5,74,null,100,null,"M5",3999,1935,1455,1135,"DIG-T 117","(5.9,133,86,117)",null,"Visia, Acenta, Tekna,","N-Connecta,","Visia Plus"]
["Nissan","Juke","DIG-T 117",null,null,19600,null,null,5.9,"Benzin",135,null,"6d-TEMP",5,86,null,117,null,"M6",4210,1983,1595,1182,null,null,null,null,"Visia, Acenta,","N-Connecta, Tekna,","N-Design","erhältlich"]
["Opel","Astra","1.2 Turbo","Direct Injection",null,21739,null,null,5.2,"Benzin",119,null,"6d",5,81,null,110,null,"M6",4370,2042,1485,1280,"1.2 TDI","(5.3,120,96,130)","1.2 TDI","(5.3,120,107,145)",null,null,"Edition, GS-Line,"]
["Opel","Corsa","1.2l",null,null,14999,null,null,5.4,"Benzin",123,null,"6d",5,55,null,75,null,"M5",4060,1960,1433,1055,"1.2 (5.5,124,74,100)","1.2 (5.6,128,96,130)",null,null,null,null,"Edition, Elegance,"]
["Opel","Astra ST","1.2 Turbo","Direct Injection",null,23339,null,null,5.4,"Benzin",122,null,"6d",5,81,null,110,null,"M6",4702,2040,1510,1355,"1.2 TDI","(5.4,122,96,130)","1.2 TDI","(5.4,122,107,145)",null,null,"Edition, GS Line,","erhältlich"]
["Opel","Insignia","1.5 Turbo","Direct Injection",null,30730,null,null,6.1,"Benzin",138,null,"6d-TEMP",5,103,null,140,null,"M6",4897,2093,1455,1441,"1.5 TDI","(6.1,138,121,165)",null,null,null,null,"Edition, Dynamic,"]
["Opel","Crossland X","1.2l",null,null,19839,null,null,6.2,"Benzin",139,null,"6d",5,60,null,81,null,"M5",4212,1976,1605,1174,"1.2 Turbo","(6.1,138,81,110)","1.2 Turbo","(5.9,134,96,130)","Edition, Ultimate","Innovation",null,"Allure",null,"Als 3-Türer oder","5-Türer erhältlich"]
["Opel","Grandland X","1.2 Turbo",null,null,26729,null,null,6.4,"Benzin",145,null,"6d",5,96,null,130,null,"M6",4477,2098,1609,1350,"1.6 Turbo","(7.2,163,133,181)",null,null,"Edition, Ultimate","Innovation",null,"Limited,","La Parisienne","Höhe entspricht","Micro-Van"]
["Opel","Corsa",44317,null,null,20389,null,null,4.0999999999999996,"Benzin",107,null,"6d-TEMP",5,75,null,102,null,"M6",4060,1960,1433,1165,null,null,null,null,"Edition, GS-Line,","Elegance",null,null,"Zen, Limited,","Intens, Life",null,"Auch als Kombi","erhältlich "]
["Opel","Astra","1.5 CDTI",null,null,23739,null,null,4.3,"Benzin",112,null,"6d",5,77,null,105,null,"M6",4370,2042,1485,1371,"1.5 CDTI","(4.4,116,90,122)",null,null,"Edition, GS-Line,","Elegance, Ultimate",null,null,"Intens, Life, Bose","GT-Line"]
["Opel","Astra Sports Tourer","1.5 CDTI",null,null,25339,null,null,4.3,"Benzin",113,null,"6d",5,77,null,105,null,"M6",4702,2042,1485,1395,"1.5 CDTI","(4.4,116,90,122)",null,null,"Astra, Edition,","GS Line, Elegance,","Ultimate"]
["Opel","Insignia ","1.5 CDTI",null,null,32699,null,null,4.5999999999999996,"Benzin",121,null,"6d-TEMP",5,90,null,122,null,"M6",4897,2093,1455,1503,"2.0 CDTI","(4.7,122,128,174)",null,null,"Edition, Business","Elegance",null,null,null,"Auch als Grand","Scenic erhältlich"]
["Opel","Crossland X","1.5 CDTI",null,null,22349,null,null,4.7,"Benzin",123,null,"6d-TEMP",5,75,null,102,null,"M6",4212,1976,1605,1289,"1.5 CDTI","(5.2,137,88,120)",null,null,"Edition, Innovation,","Ultimate",null,"Grandtour erhältlich"]
["Opel","Grandland X","1.5 CDTI",null,null,29309,null,null,5.2,"Benzin",136,null,"6d-TEMP",5,96,null,130,null,"M6",4477,2098,1609,1435,null,null,null,null,"Edition, Innovation,","Ultimate"]
["Opel","Corsa",44317,null,null,20389,null,null,4.0999999999999996,"Diesel",107,null,"6d-TEMP",5,75,null,102,null,"M6","4 060","1 960","1 433","1 165",null,null,null,null,"Edition, GS-Line,","Elegance"]
["Opel","Astra","1.5 CDTI",null,null,23739,null,null,4.3,"Diesel",112,null,"6d",5,77,null,105,null,"M6","4 370","2 042","1 485","1 371","1.5 CDTI","(4.4,116,90,122)",null,null,"Edition, GS-Line,","Elegance, Ultimate"]
["Opel","Astra Sports Tourer","1.5 CDTI",null,null,25339,null,null,4.3,"Diesel",113,null,"6d",5,77,null,105,null,"M6","4 702","2 042","1 485","1 395","1.5 CDTI","(4.4,116,90,122)",null,null,"Astra, Edition,","GS Line, Elegance,","Ultimate"]
["Opel","Insignia","1.5 CDTI",null,null,32699,null,null,4.5999999999999996,"Diesel",121,null,"6d-TEMP",5,90,null,122,null,"M6","4 897","2 093","1 455","1 503","2.0 CDTI","(4.7,122,128,174)",null,null,"Edition, Business","Elegance",null,null,"Style, Xcellence,","Reference"]
["Peugeot",208,"PureTech 75","S&S",null,15990,null,null,5.4,"Benzin",123,null,"6d",5,55,null,75,null,"M5",4055,1960,1430,1055,"PureTech 100","(5.4,123,74,101)","PureTech 130","(5.6,127,96,131)",null,null,"Like, Active, Allure",null,"Style, Xcellence",null,null,"Auch als Kombi","erhältlich "]
["Peugeot","308 SW","PureTech 130","Start&Stop",null,23600,null,null,5.9,"Benzin",134,null,"6d",5,81,null,110,null,"M6",4585,2043,1472,1205,"PureTech 130","(5.8, 130, 96, 131)",null,null,null,null,"Active, Style,"]
["Peugeot",508,"PureTech 180",null,null,42250,null,null,6.5,"Benzin",145,null,"6d",5,133,null,181,null,"A8",4750,2079,1403,1420,null,null,null,null,null,null,"Allure, GT Line","Xcellence"]
["Peugeot",3008,"PureTech 130",null,null,26790,null,null,6.3,"Benzin",144,null,"6d",5,96,null,131,null,"M6",4447,2098,1624,1320,null,null,null,null,"Allure, Active,","Access, GT Line"]
["Peugeot",5008,"PureTech 130",null,null,28790,null,null,6.5,"Benzin",147,null,"6d",5,96,null,131,null,"M6",4641,2098,1646,1410,null,null,null,null,"Allure, Active,","Access, GT Line"]
["Peugeot",208,"BlueHDi 100","Start&Stop",null,19530,null,null,4.0999999999999996,"Benzin",108,null,"6d-TEMP",5,75,null,102,null,"M6",4055,1960,1430,1165,null,null,null,null,"Like, Active,","Allure, GT Line"]
["Peugeot",308,"BlueHDi 100",null,null,23850,null,null,4.5,"Benzin",118,null,"6d-TEMP",5,75,null,102,null,"M6",4253,2043,1457,1205,"1.5 BlueHDi 130","(4.5,119,96,131)",null,null,"Active, Allure, Access,","GT-Line, Style",null,"Style, Monte Carlo",null,"Auch als Combi","erhältlich "]
["Peugeot",508,"BlueHDi 130",null,null,36750,null,null,4.7,"Benzin",120,null,"6d-TEMP",5,96,null,130,null,"M6",4750,2079,1403,1415,"BlueHDI 160","(5.5,144,120,163),","BlueHDI 180","(5.7,150,130,177)","Active, Allure,","GT Line, GT",null,null,"Active, Amibition,","Style, Monte Carlo"]
["Peugeot","308 SW","BlueHDi 130",null,null,27800,null,null,4.7,"Benzin",122,null,"6d-TEMP",5,96,null,130,null,"M6",4585,2043,1472,1205,null,null,null,null,"Active, Allure,","GT Line, Access,","Style",null,"Sport",null,null,"Auch als Rapid","Spaceback erhältlich "]
["Peugeot",2008,"BlueHDi 100",null,null,25510,null,null,4.5,"Benzin",118,null,"6d-TEMP",5,75,null,100,null,"M6",4300,1987,1530,1205,"BlueHDi 130","(4.9,129,96,130)",null,null,"Allure, Active,","GT-Line","Länge entspricht","shine"]
["Peugeot",3008,"BlueHDi 130",null,null,33000,null,null,5.2,"Benzin",136,null,"6d-TEMP",5,96,null,130,null,"M6",4447,2098,1624,1417,"BlueHDI 180","(6.1,162,130,180)",null,null,"Allure, GT Line,","Active, Crossway"]
["Peugeot",5008,"BlueHDi 130",null,null,34900,null,null,5.3,"Benzin",137,null,"6d-TEMP",5,96,null,130,null,"M6",4641,2098,1646,1430,null,null,null,null,"Allure, GT Line,","Active, Crossway"]
["Peugeot",208,"BlueHDi 100","Start&Stop",null,19530,null,null,4.0999999999999996,"Diesel",108,null,"6d-TEMP",5,75,null,102,null,"M6","4 055","1 960","1 430","1 165",null,null,null,null,"Like, Active,","Allure, GT Line"]
["Peugeot",308,"BlueHDi 100",null,null,23850,null,null,4.5,"Diesel",118,null,"6d-TEMP",5,75,null,102,null,"M6","4 253","2 043","1 457","1 205","1.5 BlueHDi 130","(4.5,119,96,131)",null,null,"Active, Allure, Access,","GT-Line, Style",null,"Kompakt-Van"]
["Peugeot",508,"BlueHDi 130",null,null,36750,null,null,4.7,"Diesel",120,null,"6d-TEMP",5,96,null,130,null,"M6","4 750","2 079","1 403","1 415","BlueHDI 160","(5.5,144,120,163),","BlueHDI 180","(5.7,150,130,177)","Active, Allure,","GT Line, GT",null,"Kompakt-Van"]
["Peugeot","308 SW","BlueHDi 130",null,null,27800,null,null,4.7,"Diesel",122,null,"6d-TEMP",5,96,null,130,null,"M6","4 585","2 043","1 472","1 205",null,null,null,null,"Active, Allure,","GT Line, Access,","Style","x-cite, x-clusiv,","x-style"]
["Peugeot",2008,"BlueHDi 100",null,null,25510,null,null,4.5,"Diesel",118,null,"6d-TEMP",5,75,null,100,null,"M6","4 300","1 987","1 530","1 205","BlueHDi 130","(4.9,129,96,130)",null,null,"Allure, Active,","GT-Line","Länge entspricht"]
["Peugeot ",108,"1.0 VTi 72",null,null,12740,null,null,4.8,"Benzin",109,null,"6d-TEMP",4,53,null,72,null,"M5",3475,1884,1460,915,null,null,null,"Active,","Allure, Collection",null,"Als 3-Türer oder",null,"Young, Active,","Style"]
["Renault","Twingo","SCe 75",null,null,9990,null,null,5.3,"Benzin",119,null,"6d-TEMP-EVAP",4,54,null,74,null,"M5",3615,1646,1541,981,"TCe 95","(5.3,119,68,93)",null,"Life, Intens, Zen",null,null,null,"Highline, Trendline,","Sky"]
["Renault","Clio","SCe 75",null,null,12940,null,null,5.4,"Benzin",120,null,"6d-TEMP-EVAP",5,53,null,72,null,"M5",4050,1988,1440,1148,"TCe 100","(5.1,116,74,100)","TCe 130","(5.7,130,96,130)",null,null,"Life, Zen, Intens,",null,"Comfortline,","Highline"]
["Renault","Megane Grandtour","TCe 115",null,null,19290,null,null,5.9,"Benzin",135,null,"6d-TEMP-EVAP",5,84,null,115,null,"M6",4626,2058,1457,1231,"TCe 140","(6.0,136,103,140)","TCe 160","(6.2,140,117,159)",null,null,"Intens, Life, Bose",null,"Highline, Trendline,","Comfortline, Rabbit"]
["Renault","Captur","TCe 100",null,null,18540,null,null,5.9,"Benzin",134,null,"6d-TEMP",5,74,null,100,null,"M5",4227,2003,1576,1248,"TCe 130","(6.3,141,96,130)",null,null,"Life, Zen, Intens,","Edition One, Initiale",null,null,"Highline, Trendline,","Comfortline, Rabbit"]
["Renault","Kadjar","TCe 140",null,null,22890,null,null,6.5,"Benzin",146,null,"6d-TEMP-EVAP",5,103,null,140,null,"M6",4489,2058,1607,1442,"TCe 160","(6.6,150,117,160)",null,null,"Life, Zen, Intens,","Black Edition",null,null,"Highline,","Comfortline"]
["Renault","Scenic","TCe 115",null,null,21390,null,null,6.6,"Benzin",149,null,"6d-TEMP",5,85,null,115,null,"M6",4406,2128,1653,1528,"TCe 140","(6.8,153,103,140)","TCe 160","(6.9,155,117,160)","Zen, Intens, Limited,","Bose, Initiale"]
["Renault","Clio","Blue dCi 85",null,null,18790,null,null,4.2,"Benzin",109,null,"6d-TEMP",5,63,null,85,null,"M6",4050,1988,1440,1277,"Blue dCi 115","(4.2,110,85,115)",null,null,"Life, Zen, Intens,","RS Line"]
["Renault","Megane","Blue dCi 115",null,null,24090,null,null,4.5,"Benzin",117,null,"6d-TEMP",5,85,null,115,null,"M6",4359,2058,1447,1315,null,null,null,null,"Life, Zen, Intens,","Edition One, RS Line",null,"Highline, Sky",null,"Auch als 7-Sitzer","erhältlich"]
["Renault","Megane Grandtour","Blue dCi 115",null,null,25090,null,null,4.5,"Benzin",118,null,"6d-TEMP",5,85,null,116,null,"M6",4626,2058,1449,1315,null,null,null,null,"Limited, Intens,","Bose, GT-Line"]
["Renault","Captur","Blue dCi 115",null,null,24890,null,null,4.7,"Benzin",123,null,"6d-TEMP",5,85,null,115,null,"M6",4227,2003,1576,1490,null,null,null,null,"Life, Zen,","Intens, Edition One","Länge entspricht"]
["Renault","Kadjar","Blue dCi 115",null,null,27090,null,null,5,"Benzin",131,null,"6d-TEMP",5,85,null,115,null,"M6",4489,2058,1613,1531,"Blue dCi 150","(5.5,145,110,150)",null,null,"Zen, Intens,","Black Edition"]
["Renault","Clio","Blue dCi 85",null,null,18790,null,null,4.2,"Diesel",109,null,"6d-TEMP",5,63,null,85,null,"M6","4 050","1 988","1 440","1 277","Blue dCi 115","(4.2,110,85,115)",null,null,"Life, Zen, Intens,","RS Line",null,"Variant erhältlich"]
["Renault","Megane","Blue dCi 115",null,null,24090,null,null,4.5,"Diesel",117,null,"6d-TEMP",5,85,null,115,null,"M6","4 359","2 058","1 447","1 315",null,null,null,null,"Life, Zen, Intens,","Edition One, RS Line"]
["Renault","Megane Grandtour","Blue dCi 115",null,null,25090,null,null,4.5,"Diesel",118,null,"6d-TEMP",5,85,null,116,null,"M6","4 626","2 058","1 449","1 315",null,null,null,null,"Limited, Intens,","Bose, GT-Line"]
["Renault","Captur","Blue dCi 115",null,null,24890,null,null,4.7,"Diesel",123,null,"6d-TEMP",5,85,null,115,null,"M6","4 227","2 003","1 576","1 490",null,null,null,null,"Life, Zen,","Intens, Edition One","Länge entspricht","erhältlich"]
["Seat","Ibiza","1.0l",null,null,12990,null,null,5.4,"Benzin",122,null,"6d-TEMP",5,59,null,80,null,"M5",4059,1942,1444,1099,"1.0 ECO TSI","(5.5,123,70,95)","1.0 ECO TSI","(5.4,122,85,115)","1.0 (4.9,112,59,80)",null,"Fast Lane, Style,","erhältlich"]
["Seat","Leon","1.0 TSI",null,null,19990,null,null,5.4,"Benzin",122,null,"6d-TEMP",5,81,null,110,null,"M6",4282,1816,1459,1202,null,null,null,null,null,null,"Style, FR"]
["Seat","Arona","1.0 Eco TSI",null,null,16690,null,null,5.6,"Benzin",128,null,"6d-TEMP",5,70,null,95,null,"M5",4138,1780,1552,1180,"1.0 Eco TSI","(5.8,131,85,115)",null,null,"Style, Xcellence,","Reference, FR"]
["Seat","Ateca","1.0 Eco TSI",null,null,16690,null,null,6.5,"Benzin",146,null,"6d-TEMP",5,85,null,116,null,"M6",4363,2078,1601,1313,"1.4 TSI","(6.4,145,110,150)",null,null,"Reference, Style,","Xcellence"]
["Seat","Alhambra","1.4 TSI",null,null,40130,null,null,6.5,"Benzin",150,null,"6d-TEMP",5,110,null,150,null,"M6",4854,2081,1720,1695,null,null,null,null,"Executive,","Xcellence, FR",null,"Auch als Combi","erhältlich ","Auch als Limousine","erhältlich"]
["Seat","Arona","1.6 TDI",null,null,19990,null,null,4.8,"Benzin",125,null,"6d-TEMP",5,70,null,95,null,"M5",4138,1942,1543,1297,null,null,null,null,"Reference, Style,","Xcellence",null,"Limousine erhältlich "]
["Seat","Ateca","1.6 TDI",null,null,25880,null,null,5,"Benzin",139,null,"6d-TEMP",5,85,null,116,null,"M6",4363,2078,1601,1428,"2.0 TDI","(5.4,142,110,150)",null,null,"Reference, Style,","Xcellence",null,null,null,"4/5 Türer,","Sportstourer"]
["Seat","Arona","1.6 TDI",null,null,19990,null,null,4.8,"Diesel",125,null,"6d-TEMP",5,70,null,95,null,"M5","4 138","1 942","1 543","1 297",null,null,null,null,"Reference, Style,","Xcellence",null,"auch als Combi","erhältlich"]
["Skoda","Fabia","1.0 TSI",null,null,13240,null,null,5.4,"Benzin",123,null,"6d-TEMP-EVAP-ISC",5,70,null,95,null,"M5",3997,1958,1467,1116,"1.0 MPI","(5.8,132,44,60)",null,"Active, Ambition,","Style, Monte Carlo",null,"Auch als Combi","auch als Combi","erhältlich"]
["Skoda","Fabia Combi","1.0 TSI",null,null,13590,null,null,5.3,"Benzin",119,null,"6d-TEMP-EVAP-ISC",5,70,null,95,null,"M5",4262,1958,1488,1136,null,null,null,null,null,null,"Active, Amibition,"]
["Skoda","Scala","1.0 TSI",null,null,18980,null,null,5.5,"Benzin",126,null,"6d-TEMP-EVAP-ISC",5,70,null,95,null,"M5",4362,1988,1471,1192,"1.0 TSI","(5.5,124,85,115)","1.5 TSI","(5.7,130,110,150)",null,null,"Active, Amibition,","Spaceback erhältlich"]
["Skoda","Octavia Combi","1.0 TSI",null,null,26880,null,null,5.3,"Benzin",120,null,"6d-TEMP-EVAP-ISC",5,84,null,115,null,"M6",4689,1994,1468,1285,"1.5 TSI","(5.7, 129, 110, 150)",null,null,null,null,"Business, Premium"]
["Skoda","Superb","1.5 TSI",null,null,33840,null,null,6.2,"Benzin",141,null,"6d-TEMP-EVAP-ISC",5,110,null,150,null,"M6",4861,1864,1458,1435,null,null,null,null,null,null,"Active, Ambition,"]
["Skoda","Karoq","1.0 TSI",null,null,23980,null,null,6.3,"Benzin",142,null,"6d-TEMP-EVAP-ISC",5,85,null,116,null,"M6",4382,2025,1603,1344,"1.5 TSI","(6.3,144,110,150)",null,null,"City, Amibition,","Style"]
["Skoda","Octavia Combi","2.0 l TDI",null,null,29970,null,null,4.4000000000000004,"Benzin",117,null,"6d-TEMP-EVAP-ISC",5,85,null,116,null,"M6",4689,1994,1468,1370,"2.0 TDI","(4.6,122,110,150)",null,null,"Business, Premium",null,null,"Höhe entspricht","Microvan-Kriterien"]
["Skoda","Kamiq","1.6l TDI ",null,null,24050,null,null,5,"Benzin",131,null,"6d-TEMP-EVAP-ISC",5,85,null,115,null,"M6",4241,1988,1553,1336,null,null,null,null,"Active, Ambition","Style, Monte Carlo"]
["Skoda","Octavia Combi","2.0 l TDI",null,null,29970,null,null,4.4000000000000004,"Diesel",117,null,"6d-TEMP-EVAP-ISC",5,85,null,116,null,"M6","4 689","1 994","1 468","1 370","2.0 TDI","(4.6,122,110,150)",null,null,"Business, Premium"]
["Skoda","Kamiq","1.6l TDI",null,null,24050,null,null,5,"Diesel",131,null,"6d-TEMP-EVAP-ISC",5,85,null,115,null,"M6","4 241","1 988","1 553","1 336",null,null,null,null,"Active, Ambition","Style, Monte Carlo"]
["Suzuki","Swift","1.2 Dualjet",null,null,13490,null,null,5.0999999999999996,"Benzin",115,null,"6d-TEMP-EVAP",5,66,null,90,null,"M5",3840,1735,1480,857,null,null,null,"Clear, Shine",null,null,null,"Als 3-Türer oder","5-Türer erhältlich"]
["Suzuki","Ignis","1.2 Dualjet AGS",null,null,16390,null,null,5.6,"Benzin",126,null,"6d-TEMP-EVAP",4,66,null,90,null,"A5",3700,1660,1595,860,null,null,null,null,"Clear, Shine"]
["Suzuki","Vitara","1.4 DITC",null,null,26490,null,null,7.4,"Benzin",167,null,"6d-TEMP",5,103,null,140,null,"M6",4170,1775,1595,1205,null,null,null,null,"clear, shine",null,null,"Als 3-Türer oder","5-Türer erhältlich"]
["Toyota","Aygo","1.0 VVT-i",null,null,11490,null,null,5,"Benzin",112,null,"6d-TEMP-EVAP-ISC",4,53,null,72,null,"M5",3465,1615,1460,840,null,null,null,"x, x-play,","x-cite, x-clusiv,","x-style"]
["Toyota","Yaris","1.0 VVT-i",null,null,13190,null,null,5.8,"Benzin",131,null,"6d-TEMP-EVAP-ISC",5,53,null,72,null,"M5",3945,1695,1510,980,"1.5 VVT-i","(6.0,135,82,111)",null,"Young, Active,","Lounge"]
["Toyota","Corolla Kombi","1.2 Turbo",null,null,22290,null,null,6.2,"Benzin",140,null,"6d-TEMP",5,85,null,116,null,"M6",4650,1790,1435,1205,null,null,null,null,null,null,"Young, Active, Style"]
["VW","up!","1.0l",null,null,12680,null,null,5.4,"Benzin",123,null,"6d-TEMP-EVAP-ISC",5,44,null,60,null,"M5",3600,1910,1504,980,"1.0l","(5.3,120,85,115)",null,"black style,","white style,","R-Line, GTI"]
["VW","Polo","1.0 TSI",null,null,15110,null,null,5.3,"Benzin",120,null,"6d-TEMP-EVAP-ISC",5,85,null,115,null,"M6",4053,1964,1461,1120,"1.0 (5.4,123,44,60)",null,null,null,null,null,"Comfortline,"]
["VW","Golf","1.5 TSI ACT",null,null,26990,null,null,5.4,"Benzin",122,null,"6d-TEMP-EVAP-ISC",5,96,null,130,null,"M6",4284,1789,1491,1315,null,null,null,null,null,null,"Life"]
["VW","Golf Variant","1.0 TSI",null,null,25570,null,null,5.6,"Benzin",126,null,"6d-TEMP-EVAP-ISC",5,85,null,116,null,"M6",4567,2027,1515,1300,"1.5 TSI","(5.6,128, 96, 131)","1.5 TSI","(5.7, 130, 110, 150)",null,null,"Rabbit, Comfortline","auch als Passat","Variant erhältlich"]
["VW","Passat","1.5 TSI ACT",null,null,32590,null,null,5.8,"Benzin",133,null,"6d-TEMP-EVAP-ISC",5,110,null,150,null,"M6",4775,2083,1483,1425,"2.0 TSI","(7.6,171,140,190)",null,null,null,null,"Business, Elegance"]
["VW","T-Cross","1.0 TSI",null,null,19790,null,null,5.9,"Benzin",133,null,"6d-TEMP-EVAP-ISC",5,70,null,95,null,"M5",4108,1977,1584,1245,"1.0 TSI","(6.0,137,85,115)",null,null,"Life, Style"]
["VW","Golf Sportsvan","1.0 TSI ",null,null,27420,null,null,5.9,"Benzin",133,null,"6d-TEMP-EVAP-ISC",5,85,null,116,null,"M6",4351,2050,1613,1330,"1.5 TSI","(5.7,1130,96,131)","1.5 TSI","(6.5,147,110,150)","Highline, Comfortline"]
["VW","Golf","2.0 TDI",null,null,29390,null,null,4.0999999999999996,"Benzin",107,null,"6d-TEMP-EVAP-ISC",5,85,null,115,null,"M6",4284,1789,1491,1380,null,null,null,null,"Rabbit, Life, Style",null,null,null,null,null,null,"Ocean Race"]
["VW","Passat Limousine","2.0 TDI",null,null,36659,null,null,4.7,"Benzin",122,null,"6d-TEMP-EVAP-ISC",5,110,null,150,null,"M6",4775,2083,1483,1525,"1.6 TDI","(5.4,141,88,120)",null,null,"Business, Elegance"]
["VW","T-Roc","1,6 TDI",null,null,25770,null,null,5.2,"Benzin",136,null,"6d-TEMP-EVAP-ISC",5,85,null,115,null,"M6",4234,1992,1573,1395,"2,0 TDI","(5.4,141,110,150)",null,null,"T-Roc, Design, Sport"]
["VW","Golf Sportsvan","1.6 TDI",null,null,30120,null,null,5.2,"Benzin",136,null,"6d-TEMP-EVAP-ISC",5,85,null,116,null,"M5",4351,2050,1613,1440,"2.0 TDI","(5.4,142,110,150)",null,null,"Comfortline,","Highline"]
["VW","Golf","2.0 TDI",null,null,29390,null,null,4.0999999999999996,"Diesel",107,null,"6d-TEMP-EVAP-ISC",5,85,null,115,null,"M6","4 284","1 789","1 491","1 380",null,null,null,null,"Rabbit, Life, Style"]
["VW","Passat Limousine","2.0 TDI",null,null,36659,null,null,4.7,"Diesel",122,null,"6d-TEMP-EVAP-ISC",5,110,null,150,null,"M6","4 775","2 083","1 483","1 525","1.6 TDI","(5.4,141,88,120)",null,null,"Business, Elegance"]
["VW","T-Roc","1,6 TDI",null,null,25770,null,null,5.2,"Diesel",136,null,"6d-TEMP-EVAP-ISC",5,85,null,115,null,"M6","4 234","1 992","1 573","1 395","2,0 TDI","(5.4,141,110,150)",null,null,"T-Roc, Design, Sport"]